Arduino Forum

Products => Create => Chrome App => Topic started by: mpwteach on Jan 14, 2020, 12:39 am

Title: Arduino Create for Chromebooks broken as of Jan 13 - error: lto-wrapper failed
Post by: mpwteach on Jan 14, 2020, 12:39 am
As of this morning Jan 13th, 2020, all of my students cannot upload sketches to the Arduino UNO via the online tools and Chromebook extension.

This was working on Friday.

Here is an error message:


----------------------------------------------

Linking everything together...

lto1: fatal error: bytecode stream in file '/tmp/718722975/build/../../core/core_arduino_avr_uno_0fd389f0184d5a21fcc443ff311da7f1.a' generated with LTO version 4.1 instead of the expected 6.0

compilation terminated.

lto-wrapper: fatal error: /home/builder/.arduino15/packages/arduino/tools/avr-gcc/7.3.0-atmel3.6.1-arduino5/bin/avr-gcc returned 1 exit status

compilation terminated.

/home/builder/.arduino15/packages/arduino/tools/avr-gcc/7.3.0-atmel3.6.1-arduino5/bin/../lib/gcc/avr/7.3.0/../../../../avr/bin/ld: error: lto-wrapper failed

collect2: error: ld returned 1 exit status

exit status 1
Title: Re: Arduino Create for Chromebooks broken as of Jan 13 - error: lto-wrapper failed
Post by: maestrocaldwell on Jan 14, 2020, 01:33 am
Broken for me as well as of January 13.
Same error message, however I am using Chrome Browser on Windows 10.
Title: Re: Arduino Create for Chromebooks broken as of Jan 13 - error: lto-wrapper failed
Post by: kflanaryolayvar on Jan 14, 2020, 02:01 am
Same error in my class. Worked completely fine last week.




Error message here:

------------------------------------------------------------------------------------------------------------------------------

/home/builder/opt/arduino-builder/arduino-builder -compile -core-api-version 10611 -hardware /home/builder/opt/arduino-builder/hardware -hardware /home/builder/.arduino15/packages -tools /home/builder/opt/arduino-builder/tools -tools /home/builder/.arduino15/packages -built-in-libraries /home/builder/opt/libraries/latest -logger humantags -fqbn arduino:avr:uno -build-cache /tmp -build-path /tmp/452368454/build -verbose -prefs runtime.tools.CMSIS-Atmel.path=/home/builder/.arduino15/packages/arduino/tools/CMSIS-Atmel/1.2.0 -prefs runtime.tools.avrdude.path=/home/builder/.arduino15/packages/arduino/tools/avrdude/6.3.0-arduino17 -prefs runtime.tools.sketchUploader.path=/home/builder/.arduino15/packages/Intel/tools/sketchUploader/1.6.2+1.0 -prefs runtime.tools.flashpack.path=/home/builder/.arduino15/packages/Intel/tools/flashpack/2.0.0 -prefs runtime.tools.CMSIS.path=/home/builder/.arduino15/packages/arduino/tools/CMSIS/4.5.0 -prefs runtime.tools.avr-gcc.path=/home/builder/.arduino15/packages/arduino/tools/avr-gcc/7.3.0-atmel3.6.1-arduino5 -prefs runtime.tools.arm-linux-gcc.path=/home/builder/.arduino15/packages/arduino/tools/arm-linux-gcc/4.9.3 -prefs runtime.tools.mkspiffs.path=/home/builder/.arduino15/packages/esp8266/tools/mkspiffs/2.5.0-3-20ed2b9 -prefs runtime.tools.i586-poky-linux-uclibc.path=/home/builder/.arduino15/packages/Intel/tools/i586-poky-linux-uclibc/1.6.2+1.0 -prefs runtime.tools.arc-elf32.path=/home/builder/.arduino15/packages/Intel/tools/arc-elf32/1.6.9+1.0.1 -prefs runtime.tools.arduino101load.path=/home/builder/.arduino15/packages/Intel/tools/arduino101load/2.0.1 -prefs runtime.tools.core2-32-poky-linux.path=/home/builder/.arduino15/packages/Intel/tools/core2-32-poky-linux/1.6.2+1.0 -prefs runtime.tools.nrf5x-cl-tools.path=/home/builder/.arduino15/packages/arduino/tools/nrf5x-cl-tools/9.3.1 -prefs runtime.tools.openocd.path=/home/builder/.arduino15/packages/arduino/tools/openocd/0.10.0-arduino9 -prefs runtime.tools.arm-none-eabi-gcc.path=/home/builder/.arduino15/packages/arduino/tools/arm-none-eabi-gcc/7-2017q4 -prefs runtime.tools.bossac.path=/home/builder/.arduino15/packages/industruino/tools/bossac/1.7.0-industruino -prefs runtime.tools.esptool.path=/home/builder/.arduino15/packages/esp8266/tools/esptool/2.5.0-3-20ed2b9 -prefs runtime.tools.xtensa-lx106-elf-gcc.path=/home/builder/.arduino15/packages/esp8266/tools/xtensa-lx106-elf-gcc/2.5.0-3-20ed2b9 -prefs runtime.tools.dfu-util.path=/home/builder/.arduino15/packages/arduino/tools/dfu-util/0.9.0-arduino1 -prefs runtime.tools.linuxuploader.path=/home/builder/.arduino15/packages/arduino/tools/linuxuploader/1.5.1 -prefs runtime.tools.arduinoOTA.path=/home/builder/.arduino15/packages/arduino/tools/arduinoOTA/1.3.0 -prefs runtime.tools.x86-linux-gcc.path=/home/builder/.arduino15/packages/arduino/tools/x86-linux-gcc/7.2.0 -libraries /tmp/452368454/custom -libraries /tmp/452368454/pinned /tmp/452368454/SIK_Circuit_2A-Buzzer

Linking everything together...

lto1: fatal error: bytecode stream in file '/tmp/452368454/build/../../core/core_arduino_avr_uno_0fd389f0184d5a21fcc443ff311da7f1.a' generated with LTO version 4.1 instead of the expected 6.0

compilation terminated.

lto-wrapper: fatal error: /home/builder/.arduino15/packages/arduino/tools/avr-gcc/7.3.0-atmel3.6.1-arduino5/bin/avr-gcc returned 1 exit status

compilation terminated.

/home/builder/.arduino15/packages/arduino/tools/avr-gcc/7.3.0-atmel3.6.1-arduino5/bin/../lib/gcc/avr/7.3.0/../../../../avr/bin/ld: error: lto-wrapper failed

collect2: error: ld returned 1 exit status

exit status 1

------------------------------------------------------------------------------------------------------------------------------
Title: Re: Arduino Create for Chromebooks broken as of Jan 13 - error: lto-wrapper failed
Post by: AE_35Unit on Jan 14, 2020, 04:16 am
Appears to be the norm for now, hopefully.  I'm getting the same errors when trying to compile or compile/upload.

/home/builder/opt/arduino-builder/arduino-builder -compile -core-api-version 10611 -hardware /home/builder/opt/arduino-builder/hardware -hardware /home/builder/.arduino15/packages -tools /home/builder/opt/arduino-builder/tools -tools /home/builder/.arduino15/packages -built-in-libraries /home/builder/opt/libraries/latest -logger humantags -fqbn arduino:avr:uno -build-cache /tmp -build-path /tmp/609851392/build -verbose -prefs runtime.tools.flashpack.path=/home/builder/.arduino15/packages/Intel/tools/flashpack/2.0.0 -prefs runtime.tools.CMSIS-Atmel.path=/home/builder/.arduino15/packages/arduino/tools/CMSIS-Atmel/1.2.0 -prefs runtime.tools.arduinoOTA.path=/home/builder/.arduino15/packages/arduino/tools/arduinoOTA/1.3.0 -prefs runtime.tools.avr-gcc.path=/home/builder/.arduino15/packages/arduino/tools/avr-gcc/7.3.0-atmel3.6.1-arduino5 -prefs runtime.tools.esptool.path=/home/builder/.arduino15/packages/esp8266/tools/esptool/2.5.0-3-20ed2b9 -prefs runtime.tools.mkspiffs.path=/home/builder/.arduino15/packages/esp8266/tools/mkspiffs/2.5.0-3-20ed2b9 -prefs runtime.tools.arc-elf32.path=/home/builder/.arduino15/packages/Intel/tools/arc-elf32/1.6.9+1.0.1 -prefs runtime.tools.arm-linux-gcc.path=/home/builder/.arduino15/packages/arduino/tools/arm-linux-gcc/4.9.3 -prefs runtime.tools.arm-none-eabi-gcc.path=/home/builder/.arduino15/packages/arduino/tools/arm-none-eabi-gcc/7-2017q4 -prefs runtime.tools.avrdude.path=/home/builder/.arduino15/packages/arduino/tools/avrdude/6.3.0-arduino17 -prefs runtime.tools.dfu-util.path=/home/builder/.arduino15/packages/arduino/tools/dfu-util/0.9.0-arduino1 -prefs runtime.tools.CMSIS.path=/home/builder/.arduino15/packages/arduino/tools/CMSIS/4.5.0 -prefs runtime.tools.xtensa-lx106-elf-gcc.path=/home/builder/.arduino15/packages/esp8266/tools/xtensa-lx106-elf-gcc/2.5.0-3-20ed2b9 -prefs runtime.tools.arduino101load.path=/home/builder/.arduino15/packages/Intel/tools/arduino101load/2.0.1 -prefs runtime.tools.core2-32-poky-linux.path=/home/builder/.arduino15/packages/Intel/tools/core2-32-poky-linux/1.6.2+1.0 -prefs runtime.tools.bossac.path=/home/builder/.arduino15/packages/industruino/tools/bossac/1.7.0-industruino -prefs runtime.tools.nrf5x-cl-tools.path=/home/builder/.arduino15/packages/arduino/tools/nrf5x-cl-tools/9.3.1 -prefs runtime.tools.sketchUploader.path=/home/builder/.arduino15/packages/Intel/tools/sketchUploader/1.6.2+1.0 -prefs runtime.tools.i586-poky-linux-uclibc.path=/home/builder/.arduino15/packages/Intel/tools/i586-poky-linux-uclibc/1.6.2+1.0 -prefs runtime.tools.openocd.path=/home/builder/.arduino15/packages/arduino/tools/openocd/0.10.0-arduino9 -prefs runtime.tools.linuxuploader.path=/home/builder/.arduino15/packages/arduino/tools/linuxuploader/1.5.1 -prefs runtime.tools.x86-linux-gcc.path=/home/builder/.arduino15/packages/arduino/tools/x86-linux-gcc/7.2.0 -libraries /tmp/609851392/custom -libraries /tmp/609851392/pinned /tmp/609851392/START

Using board 'uno' from platform in folder: /home/builder/.arduino15/packages/arduino/hardware/avr/1.8.2

Using core 'arduino' from platform in folder: /home/builder/.arduino15/packages/arduino/hardware/avr/1.8.2

Detecting libraries used...

/home/builder/.arduino15/packages/arduino/tools/avr-gcc/7.3.0-atmel3.6.1-arduino5/bin/avr-g++ -c -g -Os -w -std=gnu++11 -fpermissive -fno-exceptions -ffunction-sections -fdata-sections -fno-threadsafe-statics -Wno-error=narrowing -flto -w -x c++ -E -CC -mmcu=atmega328p -DF_CPU=16000000L -DARDUINO=10611 -DARDUINO_AVR_UNO -DARDUINO_ARCH_AVR -I/home/builder/.arduino15/packages/arduino/hardware/avr/1.8.2/cores/arduino -I/home/builder/.arduino15/packages/arduino/hardware/avr/1.8.2/variants/standard /tmp/609851392/build/sketch/START.ino.cpp -o /dev/null

Generating function prototypes...

/home/builder/.arduino15/packages/arduino/tools/avr-gcc/7.3.0-atmel3.6.1-arduino5/bin/avr-g++ -c -g -Os -w -std=gnu++11 -fpermissive -fno-exceptions -ffunction-sections -fdata-sections -fno-threadsafe-statics -Wno-error=narrowing -flto -w -x c++ -E -CC -mmcu=atmega328p -DF_CPU=16000000L -DARDUINO=10611 -DARDUINO_AVR_UNO -DARDUINO_ARCH_AVR -I/home/builder/.arduino15/packages/arduino/hardware/avr/1.8.2/cores/arduino -I/home/builder/.arduino15/packages/arduino/hardware/avr/1.8.2/variants/standard /tmp/609851392/build/sketch/START.ino.cpp -o /tmp/609851392/build/preproc/ctags_target_for_gcc_minus_e.cpp

/home/builder/opt/arduino-builder/tools/ctags/5.8-arduino11/ctags -u --language-force=c++ -f - --c++-kinds=svpf --fields=KSTtzns --line-directives /tmp/609851392/build/preproc/ctags_target_for_gcc_minus_e.cpp

Compiling sketch...

/home/builder/.arduino15/packages/arduino/tools/avr-gcc/7.3.0-atmel3.6.1-arduino5/bin/avr-g++ -c -g -Os -w -std=gnu++11 -fpermissive -fno-exceptions -ffunction-sections -fdata-sections -fno-threadsafe-statics -Wno-error=narrowing -MMD -flto -mmcu=atmega328p -DF_CPU=16000000L -DARDUINO=10611 -DARDUINO_AVR_UNO -DARDUINO_ARCH_AVR -I/home/builder/.arduino15/packages/arduino/hardware/avr/1.8.2/cores/arduino -I/home/builder/.arduino15/packages/arduino/hardware/avr/1.8.2/variants/standard /tmp/609851392/build/sketch/START.ino.cpp -o /tmp/609851392/build/sketch/START.ino.cpp.o

Compiling libraries...

Compiling core...

Using precompiled core: /tmp/core/core_arduino_avr_uno_0fd389f0184d5a21fcc443ff311da7f1.a

Linking everything together...

/home/builder/.arduino15/packages/arduino/tools/avr-gcc/7.3.0-atmel3.6.1-arduino5/bin/avr-gcc -w -Os -g -flto -fuse-linker-plugin -Wl,--gc-sections -mmcu=atmega328p -o /tmp/609851392/build/START.ino.elf /tmp/609851392/build/sketch/START.ino.cpp.o /tmp/609851392/build/../../core/core_arduino_avr_uno_0fd389f0184d5a21fcc443ff311da7f1.a -L/tmp/609851392/build -lm

lto1: fatal error: bytecode stream in file '/tmp/609851392/build/../../core/core_arduino_avr_uno_0fd389f0184d5a21fcc443ff311da7f1.a' generated with LTO version 4.1 instead of the expected 6.0

compilation terminated.

lto-wrapper: fatal error: /home/builder/.arduino15/packages/arduino/tools/avr-gcc/7.3.0-atmel3.6.1-arduino5/bin/avr-gcc returned 1 exit status

compilation terminated.

/home/builder/.arduino15/packages/arduino/tools/avr-gcc/7.3.0-atmel3.6.1-arduino5/bin/../lib/gcc/avr/7.3.0/../../../../avr/bin/ld: error: lto-wrapper failed

collect2: error: ld returned 1 exit status

exit status 1
Title: Re: Arduino Create for Chromebooks broken as of Jan 13 - error: lto-wrapper failed
Post by: ballscrewbob on Jan 14, 2020, 01:46 pm
According to the team it was fixed.
Thanks for your report.

Bob.
Title: Re: Arduino Create for Chromebooks broken as of Jan 13 - error: lto-wrapper failed
Post by: Don_Chingon on Jan 18, 2020, 08:59 pm
me sucede lo mismo y ya no aparecen las bibliotecas
tuve que cambiar a windows