Go Down

Topic: New install and compile errors. (Read 319 times) previous topic - next topic

CodeViking

hello,

just getting started with playing with arduino ...

so i installed my IDE into D:\MyPrograms\Arduino


building a lib i need access to defined nano symbols so i have something like this:


#ifndef SYS_H
#define SYS_H

#include <Arduion.h>


void echoPing(void);

#endif
 

when compiling i get this... NOT FOUND


Detecting libraries used...
"D:\MyPrograms\Arduino\hardware\tools\avr/bin/avr-g++" -c -g -Os -w -std=gnu++11 -fpermissive -fno-exceptions -ffunction-sections -fdata-sections -fno-threadsafe-statics  -flto -w -x c++ -E -CC -mmcu=atmega328p -DF_CPU=16000000L -DARDUINO=10805 -DARDUINO_AVR_NANO -DARDUINO_ARCH_AVR   "-ID:\MyPrograms\Arduino\hardware\arduino\avr\cores\arduino" "-ID:\MyPrograms\Arduino\hardware\arduino\avr\variants\eightanaloginputs" "C:\Users\ErikO\AppData\Local\Temp\arduino_build_850761\sketch\EchoVision.ino.cpp" -o "nul"
"D:\MyPrograms\Arduino\hardware\tools\avr/bin/avr-g++" -c -g -Os -w -std=gnu++11 -fpermissive -fno-exceptions -ffunction-sections -fdata-sections -fno-threadsafe-statics  -flto -w -x c++ -E -CC -mmcu=atmega328p -DF_CPU=16000000L -DARDUINO=10805 -DARDUINO_AVR_NANO -DARDUINO_ARCH_AVR   "-ID:\MyPrograms\Arduino\hardware\arduino\avr\cores\arduino" "-ID:\MyPrograms\Arduino\hardware\arduino\avr\variants\eightanaloginputs" "-ID:\RemoteDrives\GoogleDrive\arduino\libraries\EchoVision" "C:\Users\ErikO\AppData\Local\Temp\arduino_build_850761\sketch\EchoVision.ino.cpp" -o "nul"
"D:\MyPrograms\Arduino\hardware\tools\avr/bin/avr-g++" -c -g -Os -w -std=gnu++11 -fpermissive -fno-exceptions -ffunction-sections -fdata-sections -fno-threadsafe-statics  -flto -w -x c++ -E -CC -mmcu=atmega328p -DF_CPU=16000000L -DARDUINO=10805 -DARDUINO_AVR_NANO -DARDUINO_ARCH_AVR   "-ID:\MyPrograms\Arduino\hardware\arduino\avr\cores\arduino" "-ID:\MyPrograms\Arduino\hardware\arduino\avr\variants\eightanaloginputs" "-ID:\RemoteDrives\GoogleDrive\arduino\libraries\EchoVision" "C:\Users\ErikO\AppData\Local\Temp\arduino_build_850761\sketch\EchoVision.ino.cpp" -o "C:\Users\ErikO\AppData\Local\Temp\arduino_build_850761\preproc\ctags_target_for_gcc_minus_e.cpp"
In file included from D:\RemoteDrives\GoogleDrive\arduino\EchoVision\EchoVision.ino:2:0:

D:\RemoteDrives\GoogleDrive\arduino\libraries\EchoVision/sys.h:5:21: fatal error: Arduion.h: No such file or directory

 #include <Arduion.h>

                     ^

compilation terminated.


some of the folders are listed as:


"-ID:\RemoteDrives\GoogleDrive\arduino\libraries\EchoVision"

with -I inside the path... IS THAT NORMAL?


-TNX






CodeViking



FULL DUMP



Arduino: 1.8.5 (Windows 10), Board: "Arduino Nano, ATmega328P"

D:\MyPrograms\Arduino\arduino-builder -dump-prefs -logger=machine -hardware D:\MyPrograms\Arduino\hardware -tools D:\MyPrograms\Arduino\tools-builder -tools D:\MyPrograms\Arduino\hardware\tools\avr -built-in-libraries D:\MyPrograms\Arduino\libraries -libraries D:\RemoteDrives\GoogleDrive\arduino\libraries -fqbn=arduino:avr:nano:cpu=atmega328 -ide-version=10805 -build-path C:\Users\ErikO\AppData\Local\Temp\arduino_build_850761 -warnings=all -build-cache C:\Users\ErikO\AppData\Local\Temp\arduino_cache_565914 -prefs=build.warn_data_percentage=75 -prefs=runtime.tools.arduinoOTA.path=D:\MyPrograms\Arduino\hardware\tools\avr -prefs=runtime.tools.avr-gcc.path=D:\MyPrograms\Arduino\hardware\tools\avr -prefs=runtime.tools.avrdude.path=D:\MyPrograms\Arduino\hardware\tools\avr -verbose D:\RemoteDrives\GoogleDrive\arduino\EchoVision\EchoVision.ino
D:\MyPrograms\Arduino\arduino-builder -compile -logger=machine -hardware D:\MyPrograms\Arduino\hardware -tools D:\MyPrograms\Arduino\tools-builder -tools D:\MyPrograms\Arduino\hardware\tools\avr -built-in-libraries D:\MyPrograms\Arduino\libraries -libraries D:\RemoteDrives\GoogleDrive\arduino\libraries -fqbn=arduino:avr:nano:cpu=atmega328 -ide-version=10805 -build-path C:\Users\ErikO\AppData\Local\Temp\arduino_build_850761 -warnings=all -build-cache C:\Users\ErikO\AppData\Local\Temp\arduino_cache_565914 -prefs=build.warn_data_percentage=75 -prefs=runtime.tools.arduinoOTA.path=D:\MyPrograms\Arduino\hardware\tools\avr -prefs=runtime.tools.avr-gcc.path=D:\MyPrograms\Arduino\hardware\tools\avr -prefs=runtime.tools.avrdude.path=D:\MyPrograms\Arduino\hardware\tools\avr -verbose D:\RemoteDrives\GoogleDrive\arduino\EchoVision\EchoVision.ino
Using board 'nano' from platform in folder: D:\MyPrograms\Arduino\hardware\arduino\avr
Using core 'arduino' from platform in folder: D:\MyPrograms\Arduino\hardware\arduino\avr
Detecting libraries used...
"D:\MyPrograms\Arduino\hardware\tools\avr/bin/avr-g++" -c -g -Os -w -std=gnu++11 -fpermissive -fno-exceptions -ffunction-sections -fdata-sections -fno-threadsafe-statics  -flto -w -x c++ -E -CC -mmcu=atmega328p -DF_CPU=16000000L -DARDUINO=10805 -DARDUINO_AVR_NANO -DARDUINO_ARCH_AVR   "-ID:\MyPrograms\Arduino\hardware\arduino\avr\cores\arduino" "-ID:\MyPrograms\Arduino\hardware\arduino\avr\variants\eightanaloginputs" "C:\Users\ErikO\AppData\Local\Temp\arduino_build_850761\sketch\EchoVision.ino.cpp" -o "nul"
"D:\MyPrograms\Arduino\hardware\tools\avr/bin/avr-g++" -c -g -Os -w -std=gnu++11 -fpermissive -fno-exceptions -ffunction-sections -fdata-sections -fno-threadsafe-statics  -flto -w -x c++ -E -CC -mmcu=atmega328p -DF_CPU=16000000L -DARDUINO=10805 -DARDUINO_AVR_NANO -DARDUINO_ARCH_AVR   "-ID:\MyPrograms\Arduino\hardware\arduino\avr\cores\arduino" "-ID:\MyPrograms\Arduino\hardware\arduino\avr\variants\eightanaloginputs" "-ID:\RemoteDrives\GoogleDrive\arduino\libraries\EchoVision" "C:\Users\ErikO\AppData\Local\Temp\arduino_build_850761\sketch\EchoVision.ino.cpp" -o "nul"
"D:\MyPrograms\Arduino\hardware\tools\avr/bin/avr-g++" -c -g -Os -w -std=gnu++11 -fpermissive -fno-exceptions -ffunction-sections -fdata-sections -fno-threadsafe-statics  -flto -w -x c++ -E -CC -mmcu=atmega328p -DF_CPU=16000000L -DARDUINO=10805 -DARDUINO_AVR_NANO -DARDUINO_ARCH_AVR   "-ID:\MyPrograms\Arduino\hardware\arduino\avr\cores\arduino" "-ID:\MyPrograms\Arduino\hardware\arduino\avr\variants\eightanaloginputs" "-ID:\RemoteDrives\GoogleDrive\arduino\libraries\EchoVision" "C:\Users\ErikO\AppData\Local\Temp\arduino_build_850761\sketch\EchoVision.ino.cpp" -o "C:\Users\ErikO\AppData\Local\Temp\arduino_build_850761\preproc\ctags_target_for_gcc_minus_e.cpp"
In file included from D:\RemoteDrives\GoogleDrive\arduino\EchoVision\EchoVision.ino:2:0:

D:\RemoteDrives\GoogleDrive\arduino\libraries\EchoVision/sys.h:5:21: fatal error: Arduion.h: No such file or directory

 #include <Arduion.h>

                     ^

compilation terminated.

Using library EchoVision in folder: D:\RemoteDrives\GoogleDrive\arduino\libraries\EchoVision (legacy)
exit status 1
Error compiling for board Arduino Nano.

pert

D:\RemoteDrives\GoogleDrive\arduino\libraries\EchoVision/sys.h:5:21: fatal error: Arduion.h: No such file or directory

 #include <Arduion.h>
It's spelled Arduino, not "Arduion".

CodeViking

holly sh.t ... let me check... but i have been up for some 20+ hrs... :)

CodeViking

it worked... tnx... get more sleep kids... ;)

Go Up