avr-g++ compilation error

Hello! I have installed Arduino 1.6.0 in my 32-bit windows7 PC but there is an error whenever i run any code, ever running built in codes in software. not a single program I have been able to compile, the error statement is;

C:\Program Files\Arduino/hardware/tools/avr/bin/avr-g++ -c -g -Os -w -fno-exceptions -ffunction-sections -fdata-sections -fno-threadsafe-statics -MMD -mmcu=atmega328p -DF_CPU=16000000L -DARDUINO=10600 -DARDUINO_AVR_UNO -DARDUINO_ARCH_AVR -IC:\Program Files\Arduino\hardware\arduino\avr\cores\arduino -IC:\Program Files\Arduino\hardware\arduino\avr\variants\standard C:\Users\UETian'Z\AppData\Local\Temp\build3654138619291688212.tmp\sketch_feb14a.cpp -o C:\Users\UETian'Z\AppData\Local\Temp\build3654138619291688212.tmp\sketch_feb14a.cpp.o avr-g++: error: C:\Users\UETianZ\AppData\Local\Temp\build3654138619291688212.tmp\sketch_feb14a.cpp -o C:\Users\UETianZ\AppData\Local\Temp\build3654138619291688212.tmp\sketch_feb14a.cpp.o: No such file or directory avr-g++: fatal error: no input files compilation terminated. Error compiling.

Anyone Kindly help me in this regard!!

HafizAmmar: Hello! I have installed Arduino 1.6.0 in my 32-bit windows7 PC but there is an error whenever i run any code, even running built in codes in software. not a single program I have been able to compile yet, the error statement is;

C:\Program Files\Arduino/hardware/tools/avr/bin/avr-g++ -c -g -Os -w -fno-exceptions -ffunction-sections -fdata-sections -fno-threadsafe-statics -MMD -mmcu=atmega328p -DF_CPU=16000000L -DARDUINO=10600 -DARDUINO_AVR_UNO -DARDUINO_ARCH_AVR -IC:\Program Files\Arduino\hardware\arduino\avr\cores\arduino -IC:\Program Files\Arduino\hardware\arduino\avr\variants\standard C:\Users\UETian'Z\AppData\Local\Temp\build3654138619291688212.tmp\sketch_feb14a.cpp -o C:\Users\UETian'Z\AppData\Local\Temp\build3654138619291688212.tmp\sketch_feb14a.cpp.o avr-g++: error: C:\Users\UETianZ\AppData\Local\Temp\build3654138619291688212.tmp\sketch_feb14a.cpp -o C:\Users\UETianZ\AppData\Local\Temp\build3654138619291688212.tmp\sketch_feb14a.cpp.o: No such file or directory avr-g++: fatal error: no input files compilation terminated. Error compiling.

Anyone Kindly help me in this regard!!

It is obvious that the compiler does not like the name of the directory "UETian*'Z" - the symbol *'**. Try to use another directory.