exit status 1 Error compiling for board Arduino/Genuino Uno.

I am a beginner to arduino. I wrote a code by myself, however, I do not understand what does this error message means.

Arduino: 1.8.8 (Windows Store 1.8.19.0) (Windows 10), Board: "Arduino/Genuino Uno"

C:\Users\User\Documents\Arduino\Bible_Verse\Bible_Verse.ino: In function '_GLOBAL__sub_I_lcd':

C:\Users\User\Documents\Arduino\Bible_Verse\Bible_Verse.ino:28:1: internal compiler error: Segmentation fault

 }

 ^

Please submit a full bug report,

with preprocessed source if appropriate.

See <http://gcc.gnu.org/bugs.html> for instructions.

lto-wrapper.exe: fatal error: C:\Program Files\WindowsApps\ArduinoLLC.ArduinoIDE_1.8.19.0_x86__mdqgnx93n4wtt\hardware\tools\avr/bin/avr-gcc returned 1 exit status

compilation terminated.

c:/program files/windowsapps/arduinollc.arduinoide_1.8.19.0_x86__mdqgnx93n4wtt/hardware/tools/avr/bin/../lib/gcc/avr/5.4.0/../../../../avr/bin/ld.exe: error: lto-wrapper failed

collect2.exe: error: ld returned 1 exit status

exit status 1
Error compiling for board Arduino/Genuino Uno.

This report would have more information with
"Show verbose output during compilation"
option enabled in File -> Preferences.

Please post your code

See this post.