Table élévatrice moteur pas à pas pour machine à induction

Bonjour,

J'essais de recopier et de débugger un projet qui à été offert à la communauté, et j'essais de le compiler sans avoir de grosse connaissance en Arduino. Il s'agit de la gestion d'une petite table élévatrice avec un moteur Nemma, avec sont fin de course pour l'initialisation et le tout piloter par un écran Nextion. Il s'agit d'une table pour une machine à induction qui fait juste un recuit grace à une boucle alimenté par un oscilateur. Voir plan ci-joint :

Imgur

Ce projet est basé sur une carte Arduino DUE + Nextion. J'ai téléchargé les librairies demandées :

  • Arduino Nextion
  • SdFat
  • AccelStepper

J'ai supprimé celle-ci : avr/dtostrf , car je me suis rendu compte qu'elle était intégrée.

Malheureusement j'ai des erreurs qui apparaissent en fin de compilation :

Arduino : 1.8.15 (Windows 10), Carte : "Arduino Duemilanove or Diecimila, ATmega328P"





















C:\Program Files (x86)\Arduino\arduino-builder -dump-prefs -logger=machine -hardware C:\Program Files (x86)\Arduino\hardware -hardware C:\Users\Stéphane\AppData\Local\Arduino15\packages -tools C:\Program Files (x86)\Arduino\tools-builder -tools C:\Program Files (x86)\Arduino\hardware\tools\avr -tools C:\Users\Stéphane\AppData\Local\Arduino15\packages -built-in-libraries C:\Program Files (x86)\Arduino\libraries -libraries C:\Users\Stéphane\OneDrive\Documents\Arduino\libraries -fqbn=arduino:avr:diecimila:cpu=atmega328 -ide-version=10815 -build-path C:\Users\STPHAN~1\AppData\Local\Temp\arduino_build_495330 -warnings=none -build-cache C:\Users\STPHAN~1\AppData\Local\Temp\arduino_cache_290670 -prefs=build.warn_data_percentage=75 -prefs=runtime.tools.avrdude.path=C:\Program Files (x86)\Arduino\hardware\tools\avr -prefs=runtime.tools.avrdude-6.3.0-arduino17.path=C:\Program Files (x86)\Arduino\hardware\tools\avr -prefs=runtime.tools.avr-gcc.path=C:\Program Files (x86)\Arduino\hardware\tools\avr -prefs=runtime.tools.avr-gcc-7.3.0-atmel3.6.1-arduino7.path=C:\Program Files (x86)\Arduino\hardware\tools\avr -prefs=runtime.tools.arduinoOTA.path=C:\Program Files (x86)\Arduino\hardware\tools\avr -prefs=runtime.tools.arduinoOTA-1.3.0.path=C:\Program Files (x86)\Arduino\hardware\tools\avr -verbose D:\Téléchargements\Annealer-Master\Annealer-Master.ino

C:\Program Files (x86)\Arduino\arduino-builder -compile -logger=machine -hardware C:\Program Files (x86)\Arduino\hardware -hardware C:\Users\Stéphane\AppData\Local\Arduino15\packages -tools C:\Program Files (x86)\Arduino\tools-builder -tools C:\Program Files (x86)\Arduino\hardware\tools\avr -tools C:\Users\Stéphane\AppData\Local\Arduino15\packages -built-in-libraries C:\Program Files (x86)\Arduino\libraries -libraries C:\Users\Stéphane\OneDrive\Documents\Arduino\libraries -fqbn=arduino:avr:diecimila:cpu=atmega328 -ide-version=10815 -build-path C:\Users\STPHAN~1\AppData\Local\Temp\arduino_build_495330 -warnings=none -build-cache C:\Users\STPHAN~1\AppData\Local\Temp\arduino_cache_290670 -prefs=build.warn_data_percentage=75 -prefs=runtime.tools.avrdude.path=C:\Program Files (x86)\Arduino\hardware\tools\avr -prefs=runtime.tools.avrdude-6.3.0-arduino17.path=C:\Program Files (x86)\Arduino\hardware\tools\avr -prefs=runtime.tools.avr-gcc.path=C:\Program Files (x86)\Arduino\hardware\tools\avr -prefs=runtime.tools.avr-gcc-7.3.0-atmel3.6.1-arduino7.path=C:\Program Files (x86)\Arduino\hardware\tools\avr -prefs=runtime.tools.arduinoOTA.path=C:\Program Files (x86)\Arduino\hardware\tools\avr -prefs=runtime.tools.arduinoOTA-1.3.0.path=C:\Program Files (x86)\Arduino\hardware\tools\avr -verbose D:\Téléchargements\Annealer-Master\Annealer-Master.ino

Using board 'diecimila' from platform in folder: C:\Program Files (x86)\Arduino\hardware\arduino\avr

Using core 'arduino' from platform in folder: C:\Program Files (x86)\Arduino\hardware\arduino\avr

Detecting libraries used...

"C:\\Program Files (x86)\\Arduino\\hardware\\tools\\avr/bin/avr-g++" -c -g -Os -w -std=gnu++11 -fpermissive -fno-exceptions -ffunction-sections -fdata-sections -fno-threadsafe-statics -Wno-error=narrowing -flto -w -x c++ -E -CC -mmcu=atmega328p -DF_CPU=16000000L -DARDUINO=10815 -DARDUINO_AVR_DUEMILANOVE -DARDUINO_ARCH_AVR "-IC:\\Program Files (x86)\\Arduino\\hardware\\arduino\\avr\\cores\\arduino" "-IC:\\Program Files (x86)\\Arduino\\hardware\\arduino\\avr\\variants\\standard" "C:\\Users\\STPHAN~1\\AppData\\Local\\Temp\\arduino_build_495330\\sketch\\Annealer-Master.ino.cpp" -o nul

Alternatives for SdFat.h: [SdFat@2.0.7]

ResolveLibrary(SdFat.h)

  -> candidates: [SdFat@2.0.7]

"C:\\Program Files (x86)\\Arduino\\hardware\\tools\\avr/bin/avr-g++" -c -g -Os -w -std=gnu++11 -fpermissive -fno-exceptions -ffunction-sections -fdata-sections -fno-threadsafe-statics -Wno-error=narrowing -flto -w -x c++ -E -CC -mmcu=atmega328p -DF_CPU=16000000L -DARDUINO=10815 -DARDUINO_AVR_DUEMILANOVE -DARDUINO_ARCH_AVR "-IC:\\Program Files (x86)\\Arduino\\hardware\\arduino\\avr\\cores\\arduino" "-IC:\\Program Files (x86)\\Arduino\\hardware\\arduino\\avr\\variants\\standard" "-IC:\\Program Files (x86)\\Arduino\\libraries\\SdFat\\src" "C:\\Users\\STPHAN~1\\AppData\\Local\\Temp\\arduino_build_495330\\sketch\\Annealer-Master.ino.cpp" -o nul

Alternatives for SPI.h: [SPI@1.0]

ResolveLibrary(SPI.h)

  -> candidates: [SPI@1.0]

"C:\\Program Files (x86)\\Arduino\\hardware\\tools\\avr/bin/avr-g++" -c -g -Os -w -std=gnu++11 -fpermissive -fno-exceptions -ffunction-sections -fdata-sections -fno-threadsafe-statics -Wno-error=narrowing -flto -w -x c++ -E -CC -mmcu=atmega328p -DF_CPU=16000000L -DARDUINO=10815 -DARDUINO_AVR_DUEMILANOVE -DARDUINO_ARCH_AVR "-IC:\\Program Files (x86)\\Arduino\\hardware\\arduino\\avr\\cores\\arduino" "-IC:\\Program Files (x86)\\Arduino\\hardware\\arduino\\avr\\variants\\standard" "-IC:\\Program Files (x86)\\Arduino\\libraries\\SdFat\\src" "-IC:\\Program Files (x86)\\Arduino\\hardware\\arduino\\avr\\libraries\\SPI\\src" "C:\\Users\\STPHAN~1\\AppData\\Local\\Temp\\arduino_build_495330\\sketch\\Annealer-Master.ino.cpp" -o nul

Alternatives for AccelStepper.h: [AccelStepper]

ResolveLibrary(AccelStepper.h)

  -> candidates: [AccelStepper]

"C:\\Program Files (x86)\\Arduino\\hardware\\tools\\avr/bin/avr-g++" -c -g -Os -w -std=gnu++11 -fpermissive -fno-exceptions -ffunction-sections -fdata-sections -fno-threadsafe-statics -Wno-error=narrowing -flto -w -x c++ -E -CC -mmcu=atmega328p -DF_CPU=16000000L -DARDUINO=10815 -DARDUINO_AVR_DUEMILANOVE -DARDUINO_ARCH_AVR "-IC:\\Program Files (x86)\\Arduino\\hardware\\arduino\\avr\\cores\\arduino" "-IC:\\Program Files (x86)\\Arduino\\hardware\\arduino\\avr\\variants\\standard" "-IC:\\Program Files (x86)\\Arduino\\libraries\\SdFat\\src" "-IC:\\Program Files (x86)\\Arduino\\hardware\\arduino\\avr\\libraries\\SPI\\src" "-IC:\\Program Files (x86)\\Arduino\\libraries\\AccelStepper" "C:\\Users\\STPHAN~1\\AppData\\Local\\Temp\\arduino_build_495330\\sketch\\Annealer-Master.ino.cpp" -o nul

Alternatives for Nextion.h: [ITEADLIB_Arduino_Nextion-master]

ResolveLibrary(Nextion.h)

  -> candidates: [ITEADLIB_Arduino_Nextion-master]

"C:\\Program Files (x86)\\Arduino\\hardware\\tools\\avr/bin/avr-g++" -c -g -Os -w -std=gnu++11 -fpermissive -fno-exceptions -ffunction-sections -fdata-sections -fno-threadsafe-statics -Wno-error=narrowing -flto -w -x c++ -E -CC -mmcu=atmega328p -DF_CPU=16000000L -DARDUINO=10815 -DARDUINO_AVR_DUEMILANOVE -DARDUINO_ARCH_AVR "-IC:\\Program Files (x86)\\Arduino\\hardware\\arduino\\avr\\cores\\arduino" "-IC:\\Program Files (x86)\\Arduino\\hardware\\arduino\\avr\\variants\\standard" "-IC:\\Program Files (x86)\\Arduino\\libraries\\SdFat\\src" "-IC:\\Program Files (x86)\\Arduino\\hardware\\arduino\\avr\\libraries\\SPI\\src" "-IC:\\Program Files (x86)\\Arduino\\libraries\\AccelStepper" "-IC:\\Program Files (x86)\\Arduino\\libraries\\ITEADLIB_Arduino_Nextion-master" "C:\\Users\\STPHAN~1\\AppData\\Local\\Temp\\arduino_build_495330\\sketch\\Annealer-Master.ino.cpp" -o nul

"C:\\Program Files (x86)\\Arduino\\hardware\\tools\\avr/bin/avr-g++" -c -g -Os -w -std=gnu++11 -fpermissive -fno-exceptions -ffunction-sections -fdata-sections -fno-threadsafe-statics -Wno-error=narrowing -flto -w -x c++ -E -CC -mmcu=atmega328p -DF_CPU=16000000L -DARDUINO=10815 -DARDUINO_AVR_DUEMILANOVE -DARDUINO_ARCH_AVR "-IC:\\Program Files (x86)\\Arduino\\hardware\\arduino\\avr\\cores\\arduino" "-IC:\\Program Files (x86)\\Arduino\\hardware\\arduino\\avr\\variants\\standard" "-IC:\\Program Files (x86)\\Arduino\\libraries\\SdFat\\src" "-IC:\\Program Files (x86)\\Arduino\\hardware\\arduino\\avr\\libraries\\SPI\\src" "-IC:\\Program Files (x86)\\Arduino\\libraries\\AccelStepper" "-IC:\\Program Files (x86)\\Arduino\\libraries\\ITEADLIB_Arduino_Nextion-master" "C:\\Program Files (x86)\\Arduino\\libraries\\SdFat\\src\\ExFatLib\\ExFatDbg.cpp" -o nul

"C:\\Program Files (x86)\\Arduino\\hardware\\tools\\avr/bin/avr-g++" -c -g -Os -w -std=gnu++11 -fpermissive -fno-exceptions -ffunction-sections -fdata-sections -fno-threadsafe-statics -Wno-error=narrowing -flto -w -x c++ -E -CC -mmcu=atmega328p -DF_CPU=16000000L -DARDUINO=10815 -DARDUINO_AVR_DUEMILANOVE -DARDUINO_ARCH_AVR "-IC:\\Program Files (x86)\\Arduino\\hardware\\arduino\\avr\\cores\\arduino" "-IC:\\Program Files (x86)\\Arduino\\hardware\\arduino\\avr\\variants\\standard" "-IC:\\Program Files (x86)\\Arduino\\libraries\\SdFat\\src" "-IC:\\Program Files (x86)\\Arduino\\hardware\\arduino\\avr\\libraries\\SPI\\src" "-IC:\\Program Files (x86)\\Arduino\\libraries\\AccelStepper" "-IC:\\Program Files (x86)\\Arduino\\libraries\\ITEADLIB_Arduino_Nextion-master" "C:\\Program Files (x86)\\Arduino\\libraries\\SdFat\\src\\ExFatLib\\ExFatFile.cpp" -o nul

"C:\\Program Files (x86)\\Arduino\\hardware\\tools\\avr/bin/avr-g++" -c -g -Os -w -std=gnu++11 -fpermissive -fno-exceptions -ffunction-sections -fdata-sections -fno-threadsafe-statics -Wno-error=narrowing -flto -w -x c++ -E -CC -mmcu=atmega328p -DF_CPU=16000000L -DARDUINO=10815 -DARDUINO_AVR_DUEMILANOVE -DARDUINO_ARCH_AVR "-IC:\\Program Files (x86)\\Arduino\\hardware\\arduino\\avr\\cores\\arduino" "-IC:\\Program Files (x86)\\Arduino\\hardware\\arduino\\avr\\variants\\standard" "-IC:\\Program Files (x86)\\Arduino\\libraries\\SdFat\\src" "-IC:\\Program Files (x86)\\Arduino\\hardware\\arduino\\avr\\libraries\\SPI\\src" "-IC:\\Program Files (x86)\\Arduino\\libraries\\AccelStepper" "-IC:\\Program Files (x86)\\Arduino\\libraries\\ITEADLIB_Arduino_Nextion-master" "C:\\Program Files (x86)\\Arduino\\libraries\\SdFat\\src\\ExFatLib\\ExFatFilePrint.cpp" -o nul

"C:\\Program Files (x86)\\Arduino\\hardware\\tools\\avr/bin/avr-g++" -c -g -Os -w -std=gnu++11 -fpermissive -fno-exceptions -ffunction-sections -fdata-sections -fno-threadsafe-statics -Wno-error=narrowing -flto -w -x c++ -E -CC -mmcu=atmega328p -DF_CPU=16000000L -DARDUINO=10815 -DARDUINO_AVR_DUEMILANOVE -DARDUINO_ARCH_AVR "-IC:\\Program Files (x86)\\Arduino\\hardware\\arduino\\avr\\cores\\arduino" "-IC:\\Program Files (x86)\\Arduino\\hardware\\arduino\\avr\\variants\\standard" "-IC:\\Program Files (x86)\\Arduino\\libraries\\SdFat\\src" "-IC:\\Program Files (x86)\\Arduino\\hardware\\arduino\\avr\\libraries\\SPI\\src" "-IC:\\Program Files (x86)\\Arduino\\libraries\\AccelStepper" "-IC:\\Program Files (x86)\\Arduino\\libraries\\ITEADLIB_Arduino_Nextion-master" "C:\\Program Files (x86)\\Arduino\\libraries\\SdFat\\src\\ExFatLib\\ExFatFileWrite.cpp" -o nul

"C:\\Program Files (x86)\\Arduino\\hardware\\tools\\avr/bin/avr-g++" -c -g -Os -w -std=gnu++11 -fpermissive -fno-exceptions -ffunction-sections -fdata-sections -fno-threadsafe-statics -Wno-error=narrowing -flto -w -x c++ -E -CC -mmcu=atmega328p -DF_CPU=16000000L -DARDUINO=10815 -DARDUINO_AVR_DUEMILANOVE -DARDUINO_ARCH_AVR "-IC:\\Program Files (x86)\\Arduino\\hardware\\arduino\\avr\\cores\\arduino" "-IC:\\Program Files (x86)\\Arduino\\hardware\\arduino\\avr\\variants\\standard" "-IC:\\Program Files (x86)\\Arduino\\libraries\\SdFat\\src" "-IC:\\Program Files (x86)\\Arduino\\hardware\\arduino\\avr\\libraries\\SPI\\src" "-IC:\\Program Files (x86)\\Arduino\\libraries\\AccelStepper" "-IC:\\Program Files (x86)\\Arduino\\libraries\\ITEADLIB_Arduino_Nextion-master" "C:\\Program Files (x86)\\Arduino\\libraries\\SdFat\\src\\ExFatLib\\ExFatFormatter.cpp" -o nul

"C:\\Program Files (x86)\\Arduino\\hardware\\tools\\avr/bin/avr-g++" -c -g -Os -w -std=gnu++11 -fpermissive -fno-exceptions -ffunction-sections -fdata-sections -fno-threadsafe-statics -Wno-error=narrowing -flto -w -x c++ -E -CC -mmcu=atmega328p -DF_CPU=16000000L -DARDUINO=10815 -DARDUINO_AVR_DUEMILANOVE -DARDUINO_ARCH_AVR "-IC:\\Program Files (x86)\\Arduino\\hardware\\arduino\\avr\\cores\\arduino" "-IC:\\Program Files (x86)\\Arduino\\hardware\\arduino\\avr\\variants\\standard" "-IC:\\Program Files (x86)\\Arduino\\libraries\\SdFat\\src" "-IC:\\Program Files (x86)\\Arduino\\hardware\\arduino\\avr\\libraries\\SPI\\src" "-IC:\\Program Files (x86)\\Arduino\\libraries\\AccelStepper" "-IC:\\Program Files (x86)\\Arduino\\libraries\\ITEADLIB_Arduino_Nextion-master" "C:\\Program Files (x86)\\Arduino\\libraries\\SdFat\\src\\ExFatLib\\ExFatPartition.cpp" -o nul

"C:\\Program Files (x86)\\Arduino\\hardware\\tools\\avr/bin/avr-g++" -c -g -Os -w -std=gnu++11 -fpermissive -fno-exceptions -ffunction-sections -fdata-sections -fno-threadsafe-statics -Wno-error=narrowing -flto -w -x c++ -E -CC -mmcu=atmega328p -DF_CPU=16000000L -DARDUINO=10815 -DARDUINO_AVR_DUEMILANOVE -DARDUINO_ARCH_AVR "-IC:\\Program Files (x86)\\Arduino\\hardware\\arduino\\avr\\cores\\arduino" "-IC:\\Program Files (x86)\\Arduino\\hardware\\arduino\\avr\\variants\\standard" "-IC:\\Program Files (x86)\\Arduino\\libraries\\SdFat\\src" "-IC:\\Program Files (x86)\\Arduino\\hardware\\arduino\\avr\\libraries\\SPI\\src" "-IC:\\Program Files (x86)\\Arduino\\libraries\\AccelStepper" "-IC:\\Program Files (x86)\\Arduino\\libraries\\ITEADLIB_Arduino_Nextion-master" "C:\\Program Files (x86)\\Arduino\\libraries\\SdFat\\src\\ExFatLib\\ExFatVolume.cpp" -o nul

"C:\\Program Files (x86)\\Arduino\\hardware\\tools\\avr/bin/avr-g++" -c -g -Os -w -std=gnu++11 -fpermissive -fno-exceptions -ffunction-sections -fdata-sections -fno-threadsafe-statics -Wno-error=narrowing -flto -w -x c++ -E -CC -mmcu=atmega328p -DF_CPU=16000000L -DARDUINO=10815 -DARDUINO_AVR_DUEMILANOVE -DARDUINO_ARCH_AVR "-IC:\\Program Files (x86)\\Arduino\\hardware\\arduino\\avr\\cores\\arduino" "-IC:\\Program Files (x86)\\Arduino\\hardware\\arduino\\avr\\variants\\standard" "-IC:\\Program Files (x86)\\Arduino\\libraries\\SdFat\\src" "-IC:\\Program Files (x86)\\Arduino\\hardware\\arduino\\avr\\libraries\\SPI\\src" "-IC:\\Program Files (x86)\\Arduino\\libraries\\AccelStepper" "-IC:\\Program Files (x86)\\Arduino\\libraries\\ITEADLIB_Arduino_Nextion-master" "C:\\Program Files (x86)\\Arduino\\libraries\\SdFat\\src\\ExFatLib\\upcase.cpp" -o nul

"C:\\Program Files (x86)\\Arduino\\hardware\\tools\\avr/bin/avr-g++" -c -g -Os -w -std=gnu++11 -fpermissive -fno-exceptions -ffunction-sections -fdata-sections -fno-threadsafe-statics -Wno-error=narrowing -flto -w -x c++ -E -CC -mmcu=atmega328p -DF_CPU=16000000L -DARDUINO=10815 -DARDUINO_AVR_DUEMILANOVE -DARDUINO_ARCH_AVR "-IC:\\Program Files (x86)\\Arduino\\hardware\\arduino\\avr\\cores\\arduino" "-IC:\\Program Files (x86)\\Arduino\\hardware\\arduino\\avr\\variants\\standard" "-IC:\\Program Files (x86)\\Arduino\\libraries\\SdFat\\src" "-IC:\\Program Files (x86)\\Arduino\\hardware\\arduino\\avr\\libraries\\SPI\\src" "-IC:\\Program Files (x86)\\Arduino\\libraries\\AccelStepper" "-IC:\\Program Files (x86)\\Arduino\\libraries\\ITEADLIB_Arduino_Nextion-master" "C:\\Program Files (x86)\\Arduino\\libraries\\SdFat\\src\\FatLib\\FatDbg.cpp" -o nul

"C:\\Program Files (x86)\\Arduino\\hardware\\tools\\avr/bin/avr-g++" -c -g -Os -w -std=gnu++11 -fpermissive -fno-exceptions -ffunction-sections -fdata-sections -fno-threadsafe-statics -Wno-error=narrowing -flto -w -x c++ -E -CC -mmcu=atmega328p -DF_CPU=16000000L -DARDUINO=10815 -DARDUINO_AVR_DUEMILANOVE -DARDUINO_ARCH_AVR "-IC:\\Program Files (x86)\\Arduino\\hardware\\arduino\\avr\\cores\\arduino" "-IC:\\Program Files (x86)\\Arduino\\hardware\\arduino\\avr\\variants\\standard" "-IC:\\Program Files (x86)\\Arduino\\libraries\\SdFat\\src" "-IC:\\Program Files (x86)\\Arduino\\hardware\\arduino\\avr\\libraries\\SPI\\src" "-IC:\\Program Files (x86)\\Arduino\\libraries\\AccelStepper" "-IC:\\Program Files (x86)\\Arduino\\libraries\\ITEADLIB_Arduino_Nextion-master" "C:\\Program Files (x86)\\Arduino\\libraries\\SdFat\\src\\FatLib\\FatFile.cpp" -o nul

"C:\\Program Files (x86)\\Arduino\\hardware\\tools\\avr/bin/avr-g++" -c -g -Os -w -std=gnu++11 -fpermissive -fno-exceptions -ffunction-sections -fdata-sections -fno-threadsafe-statics -Wno-error=narrowing -flto -w -x c++ -E -CC -mmcu=atmega328p -DF_CPU=16000000L -DARDUINO=10815 -DARDUINO_AVR_DUEMILANOVE -DARDUINO_ARCH_AVR "-IC:\\Program Files (x86)\\Arduino\\hardware\\arduino\\avr\\cores\\arduino" "-IC:\\Program Files (x86)\\Arduino\\hardware\\arduino\\avr\\variants\\standard" "-IC:\\Program Files (x86)\\Arduino\\libraries\\SdFat\\src" "-IC:\\Program Files (x86)\\Arduino\\hardware\\arduino\\avr\\libraries\\SPI\\src" "-IC:\\Program Files (x86)\\Arduino\\libraries\\AccelStepper" "-IC:\\Program Files (x86)\\Arduino\\libraries\\ITEADLIB_Arduino_Nextion-master" "C:\\Program Files (x86)\\Arduino\\libraries\\SdFat\\src\\FatLib\\FatFileLFN.cpp" -o nul

"C:\\Program Files (x86)\\Arduino\\hardware\\tools\\avr/bin/avr-g++" -c -g -Os -w -std=gnu++11 -fpermissive -fno-exceptions -ffunction-sections -fdata-sections -fno-threadsafe-statics -Wno-error=narrowing -flto -w -x c++ -E -CC -mmcu=atmega328p -DF_CPU=16000000L -DARDUINO=10815 -DARDUINO_AVR_DUEMILANOVE -DARDUINO_ARCH_AVR "-IC:\\Program Files (x86)\\Arduino\\hardware\\arduino\\avr\\cores\\arduino" "-IC:\\Program Files (x86)\\Arduino\\hardware\\arduino\\avr\\variants\\standard" "-IC:\\Program Files (x86)\\Arduino\\libraries\\SdFat\\src" "-IC:\\Program Files (x86)\\Arduino\\hardware\\arduino\\avr\\libraries\\SPI\\src" "-IC:\\Program Files (x86)\\Arduino\\libraries\\AccelStepper" "-IC:\\Program Files (x86)\\Arduino\\libraries\\ITEADLIB_Arduino_Nextion-master" "C:\\Program Files (x86)\\Arduino\\libraries\\SdFat\\src\\FatLib\\FatFilePrint.cpp" -o nul

"C:\\Program Files (x86)\\Arduino\\hardware\\tools\\avr/bin/avr-g++" -c -g -Os -w -std=gnu++11 -fpermissive -fno-exceptions -ffunction-sections -fdata-sections -fno-threadsafe-statics -Wno-error=narrowing -flto -w -x c++ -E -CC -mmcu=atmega328p -DF_CPU=16000000L -DARDUINO=10815 -DARDUINO_AVR_DUEMILANOVE -DARDUINO_ARCH_AVR "-IC:\\Program Files (x86)\\Arduino\\hardware\\arduino\\avr\\cores\\arduino" "-IC:\\Program Files (x86)\\Arduino\\hardware\\arduino\\avr\\variants\\standard" "-IC:\\Program Files (x86)\\Arduino\\libraries\\SdFat\\src" "-IC:\\Program Files (x86)\\Arduino\\hardware\\arduino\\avr\\libraries\\SPI\\src" "-IC:\\Program Files (x86)\\Arduino\\libraries\\AccelStepper" "-IC:\\Program Files (x86)\\Arduino\\libraries\\ITEADLIB_Arduino_Nextion-master" "C:\\Program Files (x86)\\Arduino\\libraries\\SdFat\\src\\FatLib\\FatFileSFN.cpp" -o nul

"C:\\Program Files (x86)\\Arduino\\hardware\\tools\\avr/bin/avr-g++" -c -g -Os -w -std=gnu++11 -fpermissive -fno-exceptions -ffunction-sections -fdata-sections -fno-threadsafe-statics -Wno-error=narrowing -flto -w -x c++ -E -CC -mmcu=atmega328p -DF_CPU=16000000L -DARDUINO=10815 -DARDUINO_AVR_DUEMILANOVE -DARDUINO_ARCH_AVR "-IC:\\Program Files (x86)\\Arduino\\hardware\\arduino\\avr\\cores\\arduino" "-IC:\\Program Files (x86)\\Arduino\\hardware\\arduino\\avr\\variants\\standard" "-IC:\\Program Files (x86)\\Arduino\\libraries\\SdFat\\src" "-IC:\\Program Files (x86)\\Arduino\\hardware\\arduino\\avr\\libraries\\SPI\\src" "-IC:\\Program Files (x86)\\Arduino\\libraries\\AccelStepper" "-IC:\\Program Files (x86)\\Arduino\\libraries\\ITEADLIB_Arduino_Nextion-master" "C:\\Program Files (x86)\\Arduino\\libraries\\SdFat\\src\\FatLib\\FatFormatter.cpp" -o nul

"C:\\Program Files (x86)\\Arduino\\hardware\\tools\\avr/bin/avr-g++" -c -g -Os -w -std=gnu++11 -fpermissive -fno-exceptions -ffunction-sections -fdata-sections -fno-threadsafe-statics -Wno-error=narrowing -flto -w -x c++ -E -CC -mmcu=atmega328p -DF_CPU=16000000L -DARDUINO=10815 -DARDUINO_AVR_DUEMILANOVE -DARDUINO_ARCH_AVR "-IC:\\Program Files (x86)\\Arduino\\hardware\\arduino\\avr\\cores\\arduino" "-IC:\\Program Files (x86)\\Arduino\\hardware\\arduino\\avr\\variants\\standard" "-IC:\\Program Files (x86)\\Arduino\\libraries\\SdFat\\src" "-IC:\\Program Files (x86)\\Arduino\\hardware\\arduino\\avr\\libraries\\SPI\\src" "-IC:\\Program Files (x86)\\Arduino\\libraries\\AccelStepper" "-IC:\\Program Files (x86)\\Arduino\\libraries\\ITEADLIB_Arduino_Nextion-master" "C:\\Program Files (x86)\\Arduino\\libraries\\SdFat\\src\\FatLib\\FatPartition.cpp" -o nul

"C:\\Program Files (x86)\\Arduino\\hardware\\tools\\avr/bin/avr-g++" -c -g -Os -w -std=gnu++11 -fpermissive -fno-exceptions -ffunction-sections -fdata-sections -fno-threadsafe-statics -Wno-error=narrowing -flto -w -x c++ -E -CC -mmcu=atmega328p -DF_CPU=16000000L -DARDUINO=10815 -DARDUINO_AVR_DUEMILANOVE -DARDUINO_ARCH_AVR "-IC:\\Program Files (x86)\\Arduino\\hardware\\arduino\\avr\\cores\\arduino" "-IC:\\Program Files (x86)\\Arduino\\hardware\\arduino\\avr\\variants\\standard" "-IC:\\Program Files (x86)\\Arduino\\libraries\\SdFat\\src" "-IC:\\Program Files (x86)\\Arduino\\hardware\\arduino\\avr\\libraries\\SPI\\src" "-IC:\\Program Files (x86)\\Arduino\\libraries\\AccelStepper" "-IC:\\Program Files (x86)\\Arduino\\libraries\\ITEADLIB_Arduino_Nextion-master" "C:\\Program Files (x86)\\Arduino\\libraries\\SdFat\\src\\FatLib\\FatVolume.cpp" -o nul

"C:\\Program Files (x86)\\Arduino\\hardware\\tools\\avr/bin/avr-g++" -c -g -Os -w -std=gnu++11 -fpermissive -fno-exceptions -ffunction-sections -fdata-sections -fno-threadsafe-statics -Wno-error=narrowing -flto -w -x c++ -E -CC -mmcu=atmega328p -DF_CPU=16000000L -DARDUINO=10815 -DARDUINO_AVR_DUEMILANOVE -DARDUINO_ARCH_AVR "-IC:\\Program Files (x86)\\Arduino\\hardware\\arduino\\avr\\cores\\arduino" "-IC:\\Program Files (x86)\\Arduino\\hardware\\arduino\\avr\\variants\\standard" "-IC:\\Program Files (x86)\\Arduino\\libraries\\SdFat\\src" "-IC:\\Program Files (x86)\\Arduino\\hardware\\arduino\\avr\\libraries\\SPI\\src" "-IC:\\Program Files (x86)\\Arduino\\libraries\\AccelStepper" "-IC:\\Program Files (x86)\\Arduino\\libraries\\ITEADLIB_Arduino_Nextion-master" "C:\\Program Files (x86)\\Arduino\\libraries\\SdFat\\src\\FreeStack.cpp" -o nul

"C:\\Program Files (x86)\\Arduino\\hardware\\tools\\avr/bin/avr-g++" -c -g -Os -w -std=gnu++11 -fpermissive -fno-exceptions -ffunction-sections -fdata-sections -fno-threadsafe-statics -Wno-error=narrowing -flto -w -x c++ -E -CC -mmcu=atmega328p -DF_CPU=16000000L -DARDUINO=10815 -DARDUINO_AVR_DUEMILANOVE -DARDUINO_ARCH_AVR "-IC:\\Program Files (x86)\\Arduino\\hardware\\arduino\\avr\\cores\\arduino" "-IC:\\Program Files (x86)\\Arduino\\hardware\\arduino\\avr\\variants\\standard" "-IC:\\Program Files (x86)\\Arduino\\libraries\\SdFat\\src" "-IC:\\Program Files (x86)\\Arduino\\hardware\\arduino\\avr\\libraries\\SPI\\src" "-IC:\\Program Files (x86)\\Arduino\\libraries\\AccelStepper" "-IC:\\Program Files (x86)\\Arduino\\libraries\\ITEADLIB_Arduino_Nextion-master" "C:\\Program Files (x86)\\Arduino\\libraries\\SdFat\\src\\FsLib\\FsFile.cpp" -o nul

"C:\\Program Files (x86)\\Arduino\\hardware\\tools\\avr/bin/avr-g++" -c -g -Os -w -std=gnu++11 -fpermissive -fno-exceptions -ffunction-sections -fdata-sections -fno-threadsafe-statics -Wno-error=narrowing -flto -w -x c++ -E -CC -mmcu=atmega328p -DF_CPU=16000000L -DARDUINO=10815 -DARDUINO_AVR_DUEMILANOVE -DARDUINO_ARCH_AVR "-IC:\\Program Files (x86)\\Arduino\\hardware\\arduino\\avr\\cores\\arduino" "-IC:\\Program Files (x86)\\Arduino\\hardware\\arduino\\avr\\variants\\standard" "-IC:\\Program Files (x86)\\Arduino\\libraries\\SdFat\\src" "-IC:\\Program Files (x86)\\Arduino\\hardware\\arduino\\avr\\libraries\\SPI\\src" "-IC:\\Program Files (x86)\\Arduino\\libraries\\AccelStepper" "-IC:\\Program Files (x86)\\Arduino\\libraries\\ITEADLIB_Arduino_Nextion-master" "C:\\Program Files (x86)\\Arduino\\libraries\\SdFat\\src\\FsLib\\FsNew.cpp" -o nul

"C:\\Program Files (x86)\\Arduino\\hardware\\tools\\avr/bin/avr-g++" -c -g -Os -w -std=gnu++11 -fpermissive -fno-exceptions -ffunction-sections -fdata-sections -fno-threadsafe-statics -Wno-error=narrowing -flto -w -x c++ -E -CC -mmcu=atmega328p -DF_CPU=16000000L -DARDUINO=10815 -DARDUINO_AVR_DUEMILANOVE -DARDUINO_ARCH_AVR "-IC:\\Program Files (x86)\\Arduino\\hardware\\arduino\\avr\\cores\\arduino" "-IC:\\Program Files (x86)\\Arduino\\hardware\\arduino\\avr\\variants\\standard" "-IC:\\Program Files (x86)\\Arduino\\libraries\\SdFat\\src" "-IC:\\Program Files (x86)\\Arduino\\hardware\\arduino\\avr\\libraries\\SPI\\src" "-IC:\\Program Files (x86)\\Arduino\\libraries\\AccelStepper" "-IC:\\Program Files (x86)\\Arduino\\libraries\\ITEADLIB_Arduino_Nextion-master" "C:\\Program Files (x86)\\Arduino\\libraries\\SdFat\\src\\FsLib\\FsVolume.cpp" -o nul

"C:\\Program Files (x86)\\Arduino\\hardware\\tools\\avr/bin/avr-g++" -c -g -Os -w -std=gnu++11 -fpermissive -fno-exceptions -ffunction-sections -fdata-sections -fno-threadsafe-statics -Wno-error=narrowing -flto -w -x c++ -E -CC -mmcu=atmega328p -DF_CPU=16000000L -DARDUINO=10815 -DARDUINO_AVR_DUEMILANOVE -DARDUINO_ARCH_AVR "-IC:\\Program Files (x86)\\Arduino\\hardware\\arduino\\avr\\cores\\arduino" "-IC:\\Program Files (x86)\\Arduino\\hardware\\arduino\\avr\\variants\\standard" "-IC:\\Program Files (x86)\\Arduino\\libraries\\SdFat\\src" "-IC:\\Program Files (x86)\\Arduino\\hardware\\arduino\\avr\\libraries\\SPI\\src" "-IC:\\Program Files (x86)\\Arduino\\libraries\\AccelStepper" "-IC:\\Program Files (x86)\\Arduino\\libraries\\ITEADLIB_Arduino_Nextion-master" "C:\\Program Files (x86)\\Arduino\\libraries\\SdFat\\src\\MinimumSerial.cpp" -o nul

"C:\\Program Files (x86)\\Arduino\\hardware\\tools\\avr/bin/avr-g++" -c -g -Os -w -std=gnu++11 -fpermissive -fno-exceptions -ffunction-sections -fdata-sections -fno-threadsafe-statics -Wno-error=narrowing -flto -w -x c++ -E -CC -mmcu=atmega328p -DF_CPU=16000000L -DARDUINO=10815 -DARDUINO_AVR_DUEMILANOVE -DARDUINO_ARCH_AVR "-IC:\\Program Files (x86)\\Arduino\\hardware\\arduino\\avr\\cores\\arduino" "-IC:\\Program Files (x86)\\Arduino\\hardware\\arduino\\avr\\variants\\standard" "-IC:\\Program Files (x86)\\Arduino\\libraries\\SdFat\\src" "-IC:\\Program Files (x86)\\Arduino\\hardware\\arduino\\avr\\libraries\\SPI\\src" "-IC:\\Program Files (x86)\\Arduino\\libraries\\AccelStepper" "-IC:\\Program Files (x86)\\Arduino\\libraries\\ITEADLIB_Arduino_Nextion-master" "C:\\Program Files (x86)\\Arduino\\libraries\\SdFat\\src\\SdCard\\SdCardInfo.cpp" -o nul

"C:\\Program Files (x86)\\Arduino\\hardware\\tools\\avr/bin/avr-g++" -c -g -Os -w -std=gnu++11 -fpermissive -fno-exceptions -ffunction-sections -fdata-sections -fno-threadsafe-statics -Wno-error=narrowing -flto -w -x c++ -E -CC -mmcu=atmega328p -DF_CPU=16000000L -DARDUINO=10815 -DARDUINO_AVR_DUEMILANOVE -DARDUINO_ARCH_AVR "-IC:\\Program Files (x86)\\Arduino\\hardware\\arduino\\avr\\cores\\arduino" "-IC:\\Program Files (x86)\\Arduino\\hardware\\arduino\\avr\\variants\\standard" "-IC:\\Program Files (x86)\\Arduino\\libraries\\SdFat\\src" "-IC:\\Program Files (x86)\\Arduino\\hardware\\arduino\\avr\\libraries\\SPI\\src" "-IC:\\Program Files (x86)\\Arduino\\libraries\\AccelStepper" "-IC:\\Program Files (x86)\\Arduino\\libraries\\ITEADLIB_Arduino_Nextion-master" "C:\\Program Files (x86)\\Arduino\\libraries\\SdFat\\src\\SdCard\\SdSpiCard.cpp" -o nul

"C:\\Program Files (x86)\\Arduino\\hardware\\tools\\avr/bin/avr-g++" -c -g -Os -w -std=gnu++11 -fpermissive -fno-exceptions -ffunction-sections -fdata-sections -fno-threadsafe-statics -Wno-error=narrowing -flto -w -x c++ -E -CC -mmcu=atmega328p -DF_CPU=16000000L -DARDUINO=10815 -DARDUINO_AVR_DUEMILANOVE -DARDUINO_ARCH_AVR "-IC:\\Program Files (x86)\\Arduino\\hardware\\arduino\\avr\\cores\\arduino" "-IC:\\Program Files (x86)\\Arduino\\hardware\\arduino\\avr\\variants\\standard" "-IC:\\Program Files (x86)\\Arduino\\libraries\\SdFat\\src" "-IC:\\Program Files (x86)\\Arduino\\hardware\\arduino\\avr\\libraries\\SPI\\src" "-IC:\\Program Files (x86)\\Arduino\\libraries\\AccelStepper" "-IC:\\Program Files (x86)\\Arduino\\libraries\\ITEADLIB_Arduino_Nextion-master" "C:\\Program Files (x86)\\Arduino\\libraries\\SdFat\\src\\SdCard\\SdioTeensy.cpp" -o nul

"C:\\Program Files (x86)\\Arduino\\hardware\\tools\\avr/bin/avr-g++" -c -g -Os -w -std=gnu++11 -fpermissive -fno-exceptions -ffunction-sections -fdata-sections -fno-threadsafe-statics -Wno-error=narrowing -flto -w -x c++ -E -CC -mmcu=atmega328p -DF_CPU=16000000L -DARDUINO=10815 -DARDUINO_AVR_DUEMILANOVE -DARDUINO_ARCH_AVR "-IC:\\Program Files (x86)\\Arduino\\hardware\\arduino\\avr\\cores\\arduino" "-IC:\\Program Files (x86)\\Arduino\\hardware\\arduino\\avr\\variants\\standard" "-IC:\\Program Files (x86)\\Arduino\\libraries\\SdFat\\src" "-IC:\\Program Files (x86)\\Arduino\\hardware\\arduino\\avr\\libraries\\SPI\\src" "-IC:\\Program Files (x86)\\Arduino\\libraries\\AccelStepper" "-IC:\\Program Files (x86)\\Arduino\\libraries\\ITEADLIB_Arduino_Nextion-master" "C:\\Program Files (x86)\\Arduino\\libraries\\SdFat\\src\\SpiDriver\\SdSpiArtemis.cpp" -o nul

"C:\\Program Files (x86)\\Arduino\\hardware\\tools\\avr/bin/avr-g++" -c -g -Os -w -std=gnu++11 -fpermissive -fno-exceptions -ffunction-sections -fdata-sections -fno-threadsafe-statics -Wno-error=narrowing -flto -w -x c++ -E -CC -mmcu=atmega328p -DF_CPU=16000000L -DARDUINO=10815 -DARDUINO_AVR_DUEMILANOVE -DARDUINO_ARCH_AVR "-IC:\\Program Files (x86)\\Arduino\\hardware\\arduino\\avr\\cores\\arduino" "-IC:\\Program Files (x86)\\Arduino\\hardware\\arduino\\avr\\variants\\standard" "-IC:\\Program Files (x86)\\Arduino\\libraries\\SdFat\\src" "-IC:\\Program Files (x86)\\Arduino\\hardware\\arduino\\avr\\libraries\\SPI\\src" "-IC:\\Program Files (x86)\\Arduino\\libraries\\AccelStepper" "-IC:\\Program Files (x86)\\Arduino\\libraries\\ITEADLIB_Arduino_Nextion-master" "C:\\Program Files (x86)\\Arduino\\libraries\\SdFat\\src\\SpiDriver\\SdSpiChipSelect.cpp" -o nul

"C:\\Program Files (x86)\\Arduino\\hardware\\tools\\avr/bin/avr-g++" -c -g -Os -w -std=gnu++11 -fpermissive -fno-exceptions -ffunction-sections -fdata-sections -fno-threadsafe-statics -Wno-error=narrowing -flto -w -x c++ -E -CC -mmcu=atmega328p -DF_CPU=16000000L -DARDUINO=10815 -DARDUINO_AVR_DUEMILANOVE -DARDUINO_ARCH_AVR "-IC:\\Program Files (x86)\\Arduino\\hardware\\arduino\\avr\\cores\\arduino" "-IC:\\Program Files (x86)\\Arduino\\hardware\\arduino\\avr\\variants\\standard" "-IC:\\Program Files (x86)\\Arduino\\libraries\\SdFat\\src" "-IC:\\Program Files (x86)\\Arduino\\hardware\\arduino\\avr\\libraries\\SPI\\src" "-IC:\\Program Files (x86)\\Arduino\\libraries\\AccelStepper" "-IC:\\Program Files (x86)\\Arduino\\libraries\\ITEADLIB_Arduino_Nextion-master" "C:\\Program Files (x86)\\Arduino\\libraries\\SdFat\\src\\SpiDriver\\SdSpiDue.cpp" -o nul

"C:\\Program Files (x86)\\Arduino\\hardware\\tools\\avr/bin/avr-g++" -c -g -Os -w -std=gnu++11 -fpermissive -fno-exceptions -ffunction-sections -fdata-sections -fno-threadsafe-statics -Wno-error=narrowing -flto -w -x c++ -E -CC -mmcu=atmega328p -DF_CPU=16000000L -DARDUINO=10815 -DARDUINO_AVR_DUEMILANOVE -DARDUINO_ARCH_AVR "-IC:\\Program Files (x86)\\Arduino\\hardware\\arduino\\avr\\cores\\arduino" "-IC:\\Program Files (x86)\\Arduino\\hardware\\arduino\\avr\\variants\\standard" "-IC:\\Program Files (x86)\\Arduino\\libraries\\SdFat\\src" "-IC:\\Program Files (x86)\\Arduino\\hardware\\arduino\\avr\\libraries\\SPI\\src" "-IC:\\Program Files (x86)\\Arduino\\libraries\\AccelStepper" "-IC:\\Program Files (x86)\\Arduino\\libraries\\ITEADLIB_Arduino_Nextion-master" "C:\\Program Files (x86)\\Arduino\\libraries\\SdFat\\src\\SpiDriver\\SdSpiESP.cpp" -o nul

"C:\\Program Files (x86)\\Arduino\\hardware\\tools\\avr/bin/avr-g++" -c -g -Os -w -std=gnu++11 -fpermissive -fno-exceptions -ffunction-sections -fdata-sections -fno-threadsafe-statics -Wno-error=narrowing -flto -w -x c++ -E -CC -mmcu=atmega328p -DF_CPU=16000000L -DARDUINO=10815 -DARDUINO_AVR_DUEMILANOVE -DARDUINO_ARCH_AVR "-IC:\\Program Files (x86)\\Arduino\\hardware\\arduino\\avr\\cores\\arduino" "-IC:\\Program Files (x86)\\Arduino\\hardware\\arduino\\avr\\variants\\standard" "-IC:\\Program Files (x86)\\Arduino\\libraries\\SdFat\\src" "-IC:\\Program Files (x86)\\Arduino\\hardware\\arduino\\avr\\libraries\\SPI\\src" "-IC:\\Program Files (x86)\\Arduino\\libraries\\AccelStepper" "-IC:\\Program Files (x86)\\Arduino\\libraries\\ITEADLIB_Arduino_Nextion-master" "C:\\Program Files (x86)\\Arduino\\libraries\\SdFat\\src\\SpiDriver\\SdSpiParticle.cpp" -o nul

"C:\\Program Files (x86)\\Arduino\\hardware\\tools\\avr/bin/avr-g++" -c -g -Os -w -std=gnu++11 -fpermissive -fno-exceptions -ffunction-sections -fdata-sections -fno-threadsafe-statics -Wno-error=narrowing -flto -w -x c++ -E -CC -mmcu=atmega328p -DF_CPU=16000000L -DARDUINO=10815 -DARDUINO_AVR_DUEMILANOVE -DARDUINO_ARCH_AVR "-IC:\\Program Files (x86)\\Arduino\\hardware\\arduino\\avr\\cores\\arduino" "-IC:\\Program Files (x86)\\Arduino\\hardware\\arduino\\avr\\variants\\standard" "-IC:\\Program Files (x86)\\Arduino\\libraries\\SdFat\\src" "-IC:\\Program Files (x86)\\Arduino\\hardware\\arduino\\avr\\libraries\\SPI\\src" "-IC:\\Program Files (x86)\\Arduino\\libraries\\AccelStepper" "-IC:\\Program Files (x86)\\Arduino\\libraries\\ITEADLIB_Arduino_Nextion-master" "C:\\Program Files (x86)\\Arduino\\libraries\\SdFat\\src\\SpiDriver\\SdSpiSTM32.cpp" -o nul

"C:\\Program Files (x86)\\Arduino\\hardware\\tools\\avr/bin/avr-g++" -c -g -Os -w -std=gnu++11 -fpermissive -fno-exceptions -ffunction-sections -fdata-sections -fno-threadsafe-statics -Wno-error=narrowing -flto -w -x c++ -E -CC -mmcu=atmega328p -DF_CPU=16000000L -DARDUINO=10815 -DARDUINO_AVR_DUEMILANOVE -DARDUINO_ARCH_AVR "-IC:\\Program Files (x86)\\Arduino\\hardware\\arduino\\avr\\cores\\arduino" "-IC:\\Program Files (x86)\\Arduino\\hardware\\arduino\\avr\\variants\\standard" "-IC:\\Program Files (x86)\\Arduino\\libraries\\SdFat\\src" "-IC:\\Program Files (x86)\\Arduino\\hardware\\arduino\\avr\\libraries\\SPI\\src" "-IC:\\Program Files (x86)\\Arduino\\libraries\\AccelStepper" "-IC:\\Program Files (x86)\\Arduino\\libraries\\ITEADLIB_Arduino_Nextion-master" "C:\\Program Files (x86)\\Arduino\\libraries\\SdFat\\src\\SpiDriver\\SdSpiTeensy3.cpp" -o nul

"C:\\Program Files (x86)\\Arduino\\hardware\\tools\\avr/bin/avr-g++" -c -g -Os -w -std=gnu++11 -fpermissive -fno-exceptions -ffunction-sections -fdata-sections -fno-threadsafe-statics -Wno-error=narrowing -flto -w -x c++ -E -CC -mmcu=atmega328p -DF_CPU=16000000L -DARDUINO=10815 -DARDUINO_AVR_DUEMILANOVE -DARDUINO_ARCH_AVR "-IC:\\Program Files (x86)\\Arduino\\hardware\\arduino\\avr\\cores\\arduino" "-IC:\\Program Files (x86)\\Arduino\\hardware\\arduino\\avr\\variants\\standard" "-IC:\\Program Files (x86)\\Arduino\\libraries\\SdFat\\src" "-IC:\\Program Files (x86)\\Arduino\\hardware\\arduino\\avr\\libraries\\SPI\\src" "-IC:\\Program Files (x86)\\Arduino\\libraries\\AccelStepper" "-IC:\\Program Files (x86)\\Arduino\\libraries\\ITEADLIB_Arduino_Nextion-master" "C:\\Program Files (x86)\\Arduino\\libraries\\SdFat\\src\\common\\FmtNumber.cpp" -o nul

"C:\\Program Files (x86)\\Arduino\\hardware\\tools\\avr/bin/avr-g++" -c -g -Os -w -std=gnu++11 -fpermissive -fno-exceptions -ffunction-sections -fdata-sections -fno-threadsafe-statics -Wno-error=narrowing -flto -w -x c++ -E -CC -mmcu=atmega328p -DF_CPU=16000000L -DARDUINO=10815 -DARDUINO_AVR_DUEMILANOVE -DARDUINO_ARCH_AVR "-IC:\\Program Files (x86)\\Arduino\\hardware\\arduino\\avr\\cores\\arduino" "-IC:\\Program Files (x86)\\Arduino\\hardware\\arduino\\avr\\variants\\standard" "-IC:\\Program Files (x86)\\Arduino\\libraries\\SdFat\\src" "-IC:\\Program Files (x86)\\Arduino\\hardware\\arduino\\avr\\libraries\\SPI\\src" "-IC:\\Program Files (x86)\\Arduino\\libraries\\AccelStepper" "-IC:\\Program Files (x86)\\Arduino\\libraries\\ITEADLIB_Arduino_Nextion-master" "C:\\Program Files (x86)\\Arduino\\libraries\\SdFat\\src\\common\\FsCache.cpp" -o nul

"C:\\Program Files (x86)\\Arduino\\hardware\\tools\\avr/bin/avr-g++" -c -g -Os -w -std=gnu++11 -fpermissive -fno-exceptions -ffunction-sections -fdata-sections -fno-threadsafe-statics -Wno-error=narrowing -flto -w -x c++ -E -CC -mmcu=atmega328p -DF_CPU=16000000L -DARDUINO=10815 -DARDUINO_AVR_DUEMILANOVE -DARDUINO_ARCH_AVR "-IC:\\Program Files (x86)\\Arduino\\hardware\\arduino\\avr\\cores\\arduino" "-IC:\\Program Files (x86)\\Arduino\\hardware\\arduino\\avr\\variants\\standard" "-IC:\\Program Files (x86)\\Arduino\\libraries\\SdFat\\src" "-IC:\\Program Files (x86)\\Arduino\\hardware\\arduino\\avr\\libraries\\SPI\\src" "-IC:\\Program Files (x86)\\Arduino\\libraries\\AccelStepper" "-IC:\\Program Files (x86)\\Arduino\\libraries\\ITEADLIB_Arduino_Nextion-master" "C:\\Program Files (x86)\\Arduino\\libraries\\SdFat\\src\\common\\FsDateTime.cpp" -o nul

"C:\\Program Files (x86)\\Arduino\\hardware\\tools\\avr/bin/avr-g++" -c -g -Os -w -std=gnu++11 -fpermissive -fno-exceptions -ffunction-sections -fdata-sections -fno-threadsafe-statics -Wno-error=narrowing -flto -w -x c++ -E -CC -mmcu=atmega328p -DF_CPU=16000000L -DARDUINO=10815 -DARDUINO_AVR_DUEMILANOVE -DARDUINO_ARCH_AVR "-IC:\\Program Files (x86)\\Arduino\\hardware\\arduino\\avr\\cores\\arduino" "-IC:\\Program Files (x86)\\Arduino\\hardware\\arduino\\avr\\variants\\standard" "-IC:\\Program Files (x86)\\Arduino\\libraries\\SdFat\\src" "-IC:\\Program Files (x86)\\Arduino\\hardware\\arduino\\avr\\libraries\\SPI\\src" "-IC:\\Program Files (x86)\\Arduino\\libraries\\AccelStepper" "-IC:\\Program Files (x86)\\Arduino\\libraries\\ITEADLIB_Arduino_Nextion-master" "C:\\Program Files (x86)\\Arduino\\libraries\\SdFat\\src\\common\\FsStructs.cpp" -o nul

"C:\\Program Files (x86)\\Arduino\\hardware\\tools\\avr/bin/avr-g++" -c -g -Os -w -std=gnu++11 -fpermissive -fno-exceptions -ffunction-sections -fdata-sections -fno-threadsafe-statics -Wno-error=narrowing -flto -w -x c++ -E -CC -mmcu=atmega328p -DF_CPU=16000000L -DARDUINO=10815 -DARDUINO_AVR_DUEMILANOVE -DARDUINO_ARCH_AVR "-IC:\\Program Files (x86)\\Arduino\\hardware\\arduino\\avr\\cores\\arduino" "-IC:\\Program Files (x86)\\Arduino\\hardware\\arduino\\avr\\variants\\standard" "-IC:\\Program Files (x86)\\Arduino\\libraries\\SdFat\\src" "-IC:\\Program Files (x86)\\Arduino\\hardware\\arduino\\avr\\libraries\\SPI\\src" "-IC:\\Program Files (x86)\\Arduino\\libraries\\AccelStepper" "-IC:\\Program Files (x86)\\Arduino\\libraries\\ITEADLIB_Arduino_Nextion-master" "C:\\Program Files (x86)\\Arduino\\libraries\\SdFat\\src\\iostream\\StdioStream.cpp" -o nul

"C:\\Program Files (x86)\\Arduino\\hardware\\tools\\avr/bin/avr-g++" -c -g -Os -w -std=gnu++11 -fpermissive -fno-exceptions -ffunction-sections -fdata-sections -fno-threadsafe-statics -Wno-error=narrowing -flto -w -x c++ -E -CC -mmcu=atmega328p -DF_CPU=16000000L -DARDUINO=10815 -DARDUINO_AVR_DUEMILANOVE -DARDUINO_ARCH_AVR "-IC:\\Program Files (x86)\\Arduino\\hardware\\arduino\\avr\\cores\\arduino" "-IC:\\Program Files (x86)\\Arduino\\hardware\\arduino\\avr\\variants\\standard" "-IC:\\Program Files (x86)\\Arduino\\libraries\\SdFat\\src" "-IC:\\Program Files (x86)\\Arduino\\hardware\\arduino\\avr\\libraries\\SPI\\src" "-IC:\\Program Files (x86)\\Arduino\\libraries\\AccelStepper" "-IC:\\Program Files (x86)\\Arduino\\libraries\\ITEADLIB_Arduino_Nextion-master" "C:\\Program Files (x86)\\Arduino\\libraries\\SdFat\\src\\iostream\\StreamBaseClass.cpp" -o nul

"C:\\Program Files (x86)\\Arduino\\hardware\\tools\\avr/bin/avr-g++" -c -g -Os -w -std=gnu++11 -fpermissive -fno-exceptions -ffunction-sections -fdata-sections -fno-threadsafe-statics -Wno-error=narrowing -flto -w -x c++ -E -CC -mmcu=atmega328p -DF_CPU=16000000L -DARDUINO=10815 -DARDUINO_AVR_DUEMILANOVE -DARDUINO_ARCH_AVR "-IC:\\Program Files (x86)\\Arduino\\hardware\\arduino\\avr\\cores\\arduino" "-IC:\\Program Files (x86)\\Arduino\\hardware\\arduino\\avr\\variants\\standard" "-IC:\\Program Files (x86)\\Arduino\\libraries\\SdFat\\src" "-IC:\\Program Files (x86)\\Arduino\\hardware\\arduino\\avr\\libraries\\SPI\\src" "-IC:\\Program Files (x86)\\Arduino\\libraries\\AccelStepper" "-IC:\\Program Files (x86)\\Arduino\\libraries\\ITEADLIB_Arduino_Nextion-master" "C:\\Program Files (x86)\\Arduino\\libraries\\SdFat\\src\\iostream\\istream.cpp" -o nul

"C:\\Program Files (x86)\\Arduino\\hardware\\tools\\avr/bin/avr-g++" -c -g -Os -w -std=gnu++11 -fpermissive -fno-exceptions -ffunction-sections -fdata-sections -fno-threadsafe-statics -Wno-error=narrowing -flto -w -x c++ -E -CC -mmcu=atmega328p -DF_CPU=16000000L -DARDUINO=10815 -DARDUINO_AVR_DUEMILANOVE -DARDUINO_ARCH_AVR "-IC:\\Program Files (x86)\\Arduino\\hardware\\arduino\\avr\\cores\\arduino" "-IC:\\Program Files (x86)\\Arduino\\hardware\\arduino\\avr\\variants\\standard" "-IC:\\Program Files (x86)\\Arduino\\libraries\\SdFat\\src" "-IC:\\Program Files (x86)\\Arduino\\hardware\\arduino\\avr\\libraries\\SPI\\src" "-IC:\\Program Files (x86)\\Arduino\\libraries\\AccelStepper" "-IC:\\Program Files (x86)\\Arduino\\libraries\\ITEADLIB_Arduino_Nextion-master" "C:\\Program Files (x86)\\Arduino\\libraries\\SdFat\\src\\iostream\\ostream.cpp" -o nul

"C:\\Program Files (x86)\\Arduino\\hardware\\tools\\avr/bin/avr-g++" -c -g -Os -w -std=gnu++11 -fpermissive -fno-exceptions -ffunction-sections -fdata-sections -fno-threadsafe-statics -Wno-error=narrowing -flto -w -x c++ -E -CC -mmcu=atmega328p -DF_CPU=16000000L -DARDUINO=10815 -DARDUINO_AVR_DUEMILANOVE -DARDUINO_ARCH_AVR "-IC:\\Program Files (x86)\\Arduino\\hardware\\arduino\\avr\\cores\\arduino" "-IC:\\Program Files (x86)\\Arduino\\hardware\\arduino\\avr\\variants\\standard" "-IC:\\Program Files (x86)\\Arduino\\libraries\\SdFat\\src" "-IC:\\Program Files (x86)\\Arduino\\hardware\\arduino\\avr\\libraries\\SPI\\src" "-IC:\\Program Files (x86)\\Arduino\\libraries\\AccelStepper" "-IC:\\Program Files (x86)\\Arduino\\libraries\\ITEADLIB_Arduino_Nextion-master" "C:\\Program Files (x86)\\Arduino\\hardware\\arduino\\avr\\libraries\\SPI\\src\\SPI.cpp" -o nul

"C:\\Program Files (x86)\\Arduino\\hardware\\tools\\avr/bin/avr-g++" -c -g -Os -w -std=gnu++11 -fpermissive -fno-exceptions -ffunction-sections -fdata-sections -fno-threadsafe-statics -Wno-error=narrowing -flto -w -x c++ -E -CC -mmcu=atmega328p -DF_CPU=16000000L -DARDUINO=10815 -DARDUINO_AVR_DUEMILANOVE -DARDUINO_ARCH_AVR "-IC:\\Program Files (x86)\\Arduino\\hardware\\arduino\\avr\\cores\\arduino" "-IC:\\Program Files (x86)\\Arduino\\hardware\\arduino\\avr\\variants\\standard" "-IC:\\Program Files (x86)\\Arduino\\libraries\\SdFat\\src" "-IC:\\Program Files (x86)\\Arduino\\hardware\\arduino\\avr\\libraries\\SPI\\src" "-IC:\\Program Files (x86)\\Arduino\\libraries\\AccelStepper" "-IC:\\Program Files (x86)\\Arduino\\libraries\\ITEADLIB_Arduino_Nextion-master" "C:\\Program Files (x86)\\Arduino\\libraries\\AccelStepper\\AccelStepper.cpp" -o nul

"C:\\Program Files (x86)\\Arduino\\hardware\\tools\\avr/bin/avr-g++" -c -g -Os -w -std=gnu++11 -fpermissive -fno-exceptions -ffunction-sections -fdata-sections -fno-threadsafe-statics -Wno-error=narrowing -flto -w -x c++ -E -CC -mmcu=atmega328p -DF_CPU=16000000L -DARDUINO=10815 -DARDUINO_AVR_DUEMILANOVE -DARDUINO_ARCH_AVR "-IC:\\Program Files (x86)\\Arduino\\hardware\\arduino\\avr\\cores\\arduino" "-IC:\\Program Files (x86)\\Arduino\\hardware\\arduino\\avr\\variants\\standard" "-IC:\\Program Files (x86)\\Arduino\\libraries\\SdFat\\src" "-IC:\\Program Files (x86)\\Arduino\\hardware\\arduino\\avr\\libraries\\SPI\\src" "-IC:\\Program Files (x86)\\Arduino\\libraries\\AccelStepper" "-IC:\\Program Files (x86)\\Arduino\\libraries\\ITEADLIB_Arduino_Nextion-master" "C:\\Program Files (x86)\\Arduino\\libraries\\AccelStepper\\MultiStepper.cpp" -o nul

"C:\\Program Files (x86)\\Arduino\\hardware\\tools\\avr/bin/avr-g++" -c -g -Os -w -std=gnu++11 -fpermissive -fno-exceptions -ffunction-sections -fdata-sections -fno-threadsafe-statics -Wno-error=narrowing -flto -w -x c++ -E -CC -mmcu=atmega328p -DF_CPU=16000000L -DARDUINO=10815 -DARDUINO_AVR_DUEMILANOVE -DARDUINO_ARCH_AVR "-IC:\\Program Files (x86)\\Arduino\\hardware\\arduino\\avr\\cores\\arduino" "-IC:\\Program Files (x86)\\Arduino\\hardware\\arduino\\avr\\variants\\standard" "-IC:\\Program Files (x86)\\Arduino\\libraries\\SdFat\\src" "-IC:\\Program Files (x86)\\Arduino\\hardware\\arduino\\avr\\libraries\\SPI\\src" "-IC:\\Program Files (x86)\\Arduino\\libraries\\AccelStepper" "-IC:\\Program Files (x86)\\Arduino\\libraries\\ITEADLIB_Arduino_Nextion-master" "C:\\Program Files (x86)\\Arduino\\libraries\\ITEADLIB_Arduino_Nextion-master\\NexButton.cpp" -o nul

"C:\\Program Files (x86)\\Arduino\\hardware\\tools\\avr/bin/avr-g++" -c -g -Os -w -std=gnu++11 -fpermissive -fno-exceptions -ffunction-sections -fdata-sections -fno-threadsafe-statics -Wno-error=narrowing -flto -w -x c++ -E -CC -mmcu=atmega328p -DF_CPU=16000000L -DARDUINO=10815 -DARDUINO_AVR_DUEMILANOVE -DARDUINO_ARCH_AVR "-IC:\\Program Files (x86)\\Arduino\\hardware\\arduino\\avr\\cores\\arduino" "-IC:\\Program Files (x86)\\Arduino\\hardware\\arduino\\avr\\variants\\standard" "-IC:\\Program Files (x86)\\Arduino\\libraries\\SdFat\\src" "-IC:\\Program Files (x86)\\Arduino\\hardware\\arduino\\avr\\libraries\\SPI\\src" "-IC:\\Program Files (x86)\\Arduino\\libraries\\AccelStepper" "-IC:\\Program Files (x86)\\Arduino\\libraries\\ITEADLIB_Arduino_Nextion-master" "C:\\Program Files (x86)\\Arduino\\libraries\\ITEADLIB_Arduino_Nextion-master\\NexCheckbox.cpp" -o nul

"C:\\Program Files (x86)\\Arduino\\hardware\\tools\\avr/bin/avr-g++" -c -g -Os -w -std=gnu++11 -fpermissive -fno-exceptions -ffunction-sections -fdata-sections -fno-threadsafe-statics -Wno-error=narrowing -flto -w -x c++ -E -CC -mmcu=atmega328p -DF_CPU=16000000L -DARDUINO=10815 -DARDUINO_AVR_DUEMILANOVE -DARDUINO_ARCH_AVR "-IC:\\Program Files (x86)\\Arduino\\hardware\\arduino\\avr\\cores\\arduino" "-IC:\\Program Files (x86)\\Arduino\\hardware\\arduino\\avr\\variants\\standard" "-IC:\\Program Files (x86)\\Arduino\\libraries\\SdFat\\src" "-IC:\\Program Files (x86)\\Arduino\\hardware\\arduino\\avr\\libraries\\SPI\\src" "-IC:\\Program Files (x86)\\Arduino\\libraries\\AccelStepper" "-IC:\\Program Files (x86)\\Arduino\\libraries\\ITEADLIB_Arduino_Nextion-master" "C:\\Program Files (x86)\\Arduino\\libraries\\ITEADLIB_Arduino_Nextion-master\\NexCrop.cpp" -o nul

"C:\\Program Files (x86)\\Arduino\\hardware\\tools\\avr/bin/avr-g++" -c -g -Os -w -std=gnu++11 -fpermissive -fno-exceptions -ffunction-sections -fdata-sections -fno-threadsafe-statics -Wno-error=narrowing -flto -w -x c++ -E -CC -mmcu=atmega328p -DF_CPU=16000000L -DARDUINO=10815 -DARDUINO_AVR_DUEMILANOVE -DARDUINO_ARCH_AVR "-IC:\\Program Files (x86)\\Arduino\\hardware\\arduino\\avr\\cores\\arduino" "-IC:\\Program Files (x86)\\Arduino\\hardware\\arduino\\avr\\variants\\standard" "-IC:\\Program Files (x86)\\Arduino\\libraries\\SdFat\\src" "-IC:\\Program Files (x86)\\Arduino\\hardware\\arduino\\avr\\libraries\\SPI\\src" "-IC:\\Program Files (x86)\\Arduino\\libraries\\AccelStepper" "-IC:\\Program Files (x86)\\Arduino\\libraries\\ITEADLIB_Arduino_Nextion-master" "C:\\Program Files (x86)\\Arduino\\libraries\\ITEADLIB_Arduino_Nextion-master\\NexDualStateButton.cpp" -o nul

"C:\\Program Files (x86)\\Arduino\\hardware\\tools\\avr/bin/avr-g++" -c -g -Os -w -std=gnu++11 -fpermissive -fno-exceptions -ffunction-sections -fdata-sections -fno-threadsafe-statics -Wno-error=narrowing -flto -w -x c++ -E -CC -mmcu=atmega328p -DF_CPU=16000000L -DARDUINO=10815 -DARDUINO_AVR_DUEMILANOVE -DARDUINO_ARCH_AVR "-IC:\\Program Files (x86)\\Arduino\\hardware\\arduino\\avr\\cores\\arduino" "-IC:\\Program Files (x86)\\Arduino\\hardware\\arduino\\avr\\variants\\standard" "-IC:\\Program Files (x86)\\Arduino\\libraries\\SdFat\\src" "-IC:\\Program Files (x86)\\Arduino\\hardware\\arduino\\avr\\libraries\\SPI\\src" "-IC:\\Program Files (x86)\\Arduino\\libraries\\AccelStepper" "-IC:\\Program Files (x86)\\Arduino\\libraries\\ITEADLIB_Arduino_Nextion-master" "C:\\Program Files (x86)\\Arduino\\libraries\\ITEADLIB_Arduino_Nextion-master\\NexGauge.cpp" -o nul

"C:\\Program Files (x86)\\Arduino\\hardware\\tools\\avr/bin/avr-g++" -c -g -Os -w -std=gnu++11 -fpermissive -fno-exceptions -ffunction-sections -fdata-sections -fno-threadsafe-statics -Wno-error=narrowing -flto -w -x c++ -E -CC -mmcu=atmega328p -DF_CPU=16000000L -DARDUINO=10815 -DARDUINO_AVR_DUEMILANOVE -DARDUINO_ARCH_AVR "-IC:\\Program Files (x86)\\Arduino\\hardware\\arduino\\avr\\cores\\arduino" "-IC:\\Program Files (x86)\\Arduino\\hardware\\arduino\\avr\\variants\\standard" "-IC:\\Program Files (x86)\\Arduino\\libraries\\SdFat\\src" "-IC:\\Program Files (x86)\\Arduino\\hardware\\arduino\\avr\\libraries\\SPI\\src" "-IC:\\Program Files (x86)\\Arduino\\libraries\\AccelStepper" "-IC:\\Program Files (x86)\\Arduino\\libraries\\ITEADLIB_Arduino_Nextion-master" "C:\\Program Files (x86)\\Arduino\\libraries\\ITEADLIB_Arduino_Nextion-master\\NexGpio.cpp" -o nul

"C:\\Program Files (x86)\\Arduino\\hardware\\tools\\avr/bin/avr-g++" -c -g -Os -w -std=gnu++11 -fpermissive -fno-exceptions -ffunction-sections -fdata-sections -fno-threadsafe-statics -Wno-error=narrowing -flto -w -x c++ -E -CC -mmcu=atmega328p -DF_CPU=16000000L -DARDUINO=10815 -DARDUINO_AVR_DUEMILANOVE -DARDUINO_ARCH_AVR "-IC:\\Program Files (x86)\\Arduino\\hardware\\arduino\\avr\\cores\\arduino" "-IC:\\Program Files (x86)\\Arduino\\hardware\\arduino\\avr\\variants\\standard" "-IC:\\Program Files (x86)\\Arduino\\libraries\\SdFat\\src" "-IC:\\Program Files (x86)\\Arduino\\hardware\\arduino\\avr\\libraries\\SPI\\src" "-IC:\\Program Files (x86)\\Arduino\\libraries\\AccelStepper" "-IC:\\Program Files (x86)\\Arduino\\libraries\\ITEADLIB_Arduino_Nextion-master" "C:\\Program Files (x86)\\Arduino\\libraries\\ITEADLIB_Arduino_Nextion-master\\NexHardware.cpp" -o nul

"C:\\Program Files (x86)\\Arduino\\hardware\\tools\\avr/bin/avr-g++" -c -g -Os -w -std=gnu++11 -fpermissive -fno-exceptions -ffunction-sections -fdata-sections -fno-threadsafe-statics -Wno-error=narrowing -flto -w -x c++ -E -CC -mmcu=atmega328p -DF_CPU=16000000L -DARDUINO=10815 -DARDUINO_AVR_DUEMILANOVE -DARDUINO_ARCH_AVR "-IC:\\Program Files (x86)\\Arduino\\hardware\\arduino\\avr\\cores\\arduino" "-IC:\\Program Files (x86)\\Arduino\\hardware\\arduino\\avr\\variants\\standard" "-IC:\\Program Files (x86)\\Arduino\\libraries\\SdFat\\src" "-IC:\\Program Files (x86)\\Arduino\\hardware\\arduino\\avr\\libraries\\SPI\\src" "-IC:\\Program Files (x86)\\Arduino\\libraries\\AccelStepper" "-IC:\\Program Files (x86)\\Arduino\\libraries\\ITEADLIB_Arduino_Nextion-master" "C:\\Program Files (x86)\\Arduino\\libraries\\ITEADLIB_Arduino_Nextion-master\\NexHotspot.cpp" -o nul

"C:\\Program Files (x86)\\Arduino\\hardware\\tools\\avr/bin/avr-g++" -c -g -Os -w -std=gnu++11 -fpermissive -fno-exceptions -ffunction-sections -fdata-sections -fno-threadsafe-statics -Wno-error=narrowing -flto -w -x c++ -E -CC -mmcu=atmega328p -DF_CPU=16000000L -DARDUINO=10815 -DARDUINO_AVR_DUEMILANOVE -DARDUINO_ARCH_AVR "-IC:\\Program Files (x86)\\Arduino\\hardware\\arduino\\avr\\cores\\arduino" "-IC:\\Program Files (x86)\\Arduino\\hardware\\arduino\\avr\\variants\\standard" "-IC:\\Program Files (x86)\\Arduino\\libraries\\SdFat\\src" "-IC:\\Program Files (x86)\\Arduino\\hardware\\arduino\\avr\\libraries\\SPI\\src" "-IC:\\Program Files (x86)\\Arduino\\libraries\\AccelStepper" "-IC:\\Program Files (x86)\\Arduino\\libraries\\ITEADLIB_Arduino_Nextion-master" "C:\\Program Files (x86)\\Arduino\\libraries\\ITEADLIB_Arduino_Nextion-master\\NexNumber.cpp" -o nul

"C:\\Program Files (x86)\\Arduino\\hardware\\tools\\avr/bin/avr-g++" -c -g -Os -w -std=gnu++11 -fpermissive -fno-exceptions -ffunction-sections -fdata-sections -fno-threadsafe-statics -Wno-error=narrowing -flto -w -x c++ -E -CC -mmcu=atmega328p -DF_CPU=16000000L -DARDUINO=10815 -DARDUINO_AVR_DUEMILANOVE -DARDUINO_ARCH_AVR "-IC:\\Program Files (x86)\\Arduino\\hardware\\arduino\\avr\\cores\\arduino" "-IC:\\Program Files (x86)\\Arduino\\hardware\\arduino\\avr\\variants\\standard" "-IC:\\Program Files (x86)\\Arduino\\libraries\\SdFat\\src" "-IC:\\Program Files (x86)\\Arduino\\hardware\\arduino\\avr\\libraries\\SPI\\src" "-IC:\\Program Files (x86)\\Arduino\\libraries\\AccelStepper" "-IC:\\Program Files (x86)\\Arduino\\libraries\\ITEADLIB_Arduino_Nextion-master" "C:\\Program Files (x86)\\Arduino\\libraries\\ITEADLIB_Arduino_Nextion-master\\NexObject.cpp" -o nul

"C:\\Program Files (x86)\\Arduino\\hardware\\tools\\avr/bin/avr-g++" -c -g -Os -w -std=gnu++11 -fpermissive -fno-exceptions -ffunction-sections -fdata-sections -fno-threadsafe-statics -Wno-error=narrowing -flto -w -x c++ -E -CC -mmcu=atmega328p -DF_CPU=16000000L -DARDUINO=10815 -DARDUINO_AVR_DUEMILANOVE -DARDUINO_ARCH_AVR "-IC:\\Program Files (x86)\\Arduino\\hardware\\arduino\\avr\\cores\\arduino" "-IC:\\Program Files (x86)\\Arduino\\hardware\\arduino\\avr\\variants\\standard" "-IC:\\Program Files (x86)\\Arduino\\libraries\\SdFat\\src" "-IC:\\Program Files (x86)\\Arduino\\hardware\\arduino\\avr\\libraries\\SPI\\src" "-IC:\\Program Files (x86)\\Arduino\\libraries\\AccelStepper" "-IC:\\Program Files (x86)\\Arduino\\libraries\\ITEADLIB_Arduino_Nextion-master" "C:\\Program Files (x86)\\Arduino\\libraries\\ITEADLIB_Arduino_Nextion-master\\NexPage.cpp" -o nul

"C:\\Program Files (x86)\\Arduino\\hardware\\tools\\avr/bin/avr-g++" -c -g -Os -w -std=gnu++11 -fpermissive -fno-exceptions -ffunction-sections -fdata-sections -fno-threadsafe-statics -Wno-error=narrowing -flto -w -x c++ -E -CC -mmcu=atmega328p -DF_CPU=16000000L -DARDUINO=10815 -DARDUINO_AVR_DUEMILANOVE -DARDUINO_ARCH_AVR "-IC:\\Program Files (x86)\\Arduino\\hardware\\arduino\\avr\\cores\\arduino" "-IC:\\Program Files (x86)\\Arduino\\hardware\\arduino\\avr\\variants\\standard" "-IC:\\Program Files (x86)\\Arduino\\libraries\\SdFat\\src" "-IC:\\Program Files (x86)\\Arduino\\hardware\\arduino\\avr\\libraries\\SPI\\src" "-IC:\\Program Files (x86)\\Arduino\\libraries\\AccelStepper" "-IC:\\Program Files (x86)\\Arduino\\libraries\\ITEADLIB_Arduino_Nextion-master" "C:\\Program Files (x86)\\Arduino\\libraries\\ITEADLIB_Arduino_Nextion-master\\NexPicture.cpp" -o nul

"C:\\Program Files (x86)\\Arduino\\hardware\\tools\\avr/bin/avr-g++" -c -g -Os -w -std=gnu++11 -fpermissive -fno-exceptions -ffunction-sections -fdata-sections -fno-threadsafe-statics -Wno-error=narrowing -flto -w -x c++ -E -CC -mmcu=atmega328p -DF_CPU=16000000L -DARDUINO=10815 -DARDUINO_AVR_DUEMILANOVE -DARDUINO_ARCH_AVR "-IC:\\Program Files (x86)\\Arduino\\hardware\\arduino\\avr\\cores\\arduino" "-IC:\\Program Files (x86)\\Arduino\\hardware\\arduino\\avr\\variants\\standard" "-IC:\\Program Files (x86)\\Arduino\\libraries\\SdFat\\src" "-IC:\\Program Files (x86)\\Arduino\\hardware\\arduino\\avr\\libraries\\SPI\\src" "-IC:\\Program Files (x86)\\Arduino\\libraries\\AccelStepper" "-IC:\\Program Files (x86)\\Arduino\\libraries\\ITEADLIB_Arduino_Nextion-master" "C:\\Program Files (x86)\\Arduino\\libraries\\ITEADLIB_Arduino_Nextion-master\\NexProgressBar.cpp" -o nul

"C:\\Program Files (x86)\\Arduino\\hardware\\tools\\avr/bin/avr-g++" -c -g -Os -w -std=gnu++11 -fpermissive -fno-exceptions -ffunction-sections -fdata-sections -fno-threadsafe-statics -Wno-error=narrowing -flto -w -x c++ -E -CC -mmcu=atmega328p -DF_CPU=16000000L -DARDUINO=10815 -DARDUINO_AVR_DUEMILANOVE -DARDUINO_ARCH_AVR "-IC:\\Program Files (x86)\\Arduino\\hardware\\arduino\\avr\\cores\\arduino" "-IC:\\Program Files (x86)\\Arduino\\hardware\\arduino\\avr\\variants\\standard" "-IC:\\Program Files (x86)\\Arduino\\libraries\\SdFat\\src" "-IC:\\Program Files (x86)\\Arduino\\hardware\\arduino\\avr\\libraries\\SPI\\src" "-IC:\\Program Files (x86)\\Arduino\\libraries\\AccelStepper" "-IC:\\Program Files (x86)\\Arduino\\libraries\\ITEADLIB_Arduino_Nextion-master" "C:\\Program Files (x86)\\Arduino\\libraries\\ITEADLIB_Arduino_Nextion-master\\NexRadio.cpp" -o nul

"C:\\Program Files (x86)\\Arduino\\hardware\\tools\\avr/bin/avr-g++" -c -g -Os -w -std=gnu++11 -fpermissive -fno-exceptions -ffunction-sections -fdata-sections -fno-threadsafe-statics -Wno-error=narrowing -flto -w -x c++ -E -CC -mmcu=atmega328p -DF_CPU=16000000L -DARDUINO=10815 -DARDUINO_AVR_DUEMILANOVE -DARDUINO_ARCH_AVR "-IC:\\Program Files (x86)\\Arduino\\hardware\\arduino\\avr\\cores\\arduino" "-IC:\\Program Files (x86)\\Arduino\\hardware\\arduino\\avr\\variants\\standard" "-IC:\\Program Files (x86)\\Arduino\\libraries\\SdFat\\src" "-IC:\\Program Files (x86)\\Arduino\\hardware\\arduino\\avr\\libraries\\SPI\\src" "-IC:\\Program Files (x86)\\Arduino\\libraries\\AccelStepper" "-IC:\\Program Files (x86)\\Arduino\\libraries\\ITEADLIB_Arduino_Nextion-master" "C:\\Program Files (x86)\\Arduino\\libraries\\ITEADLIB_Arduino_Nextion-master\\NexRtc.cpp" -o nul

"C:\\Program Files (x86)\\Arduino\\hardware\\tools\\avr/bin/avr-g++" -c -g -Os -w -std=gnu++11 -fpermissive -fno-exceptions -ffunction-sections -fdata-sections -fno-threadsafe-statics -Wno-error=narrowing -flto -w -x c++ -E -CC -mmcu=atmega328p -DF_CPU=16000000L -DARDUINO=10815 -DARDUINO_AVR_DUEMILANOVE -DARDUINO_ARCH_AVR "-IC:\\Program Files (x86)\\Arduino\\hardware\\arduino\\avr\\cores\\arduino" "-IC:\\Program Files (x86)\\Arduino\\hardware\\arduino\\avr\\variants\\standard" "-IC:\\Program Files (x86)\\Arduino\\libraries\\SdFat\\src" "-IC:\\Program Files (x86)\\Arduino\\hardware\\arduino\\avr\\libraries\\SPI\\src" "-IC:\\Program Files (x86)\\Arduino\\libraries\\AccelStepper" "-IC:\\Program Files (x86)\\Arduino\\libraries\\ITEADLIB_Arduino_Nextion-master" "C:\\Program Files (x86)\\Arduino\\libraries\\ITEADLIB_Arduino_Nextion-master\\NexScrolltext.cpp" -o nul

"C:\\Program Files (x86)\\Arduino\\hardware\\tools\\avr/bin/avr-g++" -c -g -Os -w -std=gnu++11 -fpermissive -fno-exceptions -ffunction-sections -fdata-sections -fno-threadsafe-statics -Wno-error=narrowing -flto -w -x c++ -E -CC -mmcu=atmega328p -DF_CPU=16000000L -DARDUINO=10815 -DARDUINO_AVR_DUEMILANOVE -DARDUINO_ARCH_AVR "-IC:\\Program Files (x86)\\Arduino\\hardware\\arduino\\avr\\cores\\arduino" "-IC:\\Program Files (x86)\\Arduino\\hardware\\arduino\\avr\\variants\\standard" "-IC:\\Program Files (x86)\\Arduino\\libraries\\SdFat\\src" "-IC:\\Program Files (x86)\\Arduino\\hardware\\arduino\\avr\\libraries\\SPI\\src" "-IC:\\Program Files (x86)\\Arduino\\libraries\\AccelStepper" "-IC:\\Program Files (x86)\\Arduino\\libraries\\ITEADLIB_Arduino_Nextion-master" "C:\\Program Files (x86)\\Arduino\\libraries\\ITEADLIB_Arduino_Nextion-master\\NexSlider.cpp" -o nul

"C:\\Program Files (x86)\\Arduino\\hardware\\tools\\avr/bin/avr-g++" -c -g -Os -w -std=gnu++11 -fpermissive -fno-exceptions -ffunction-sections -fdata-sections -fno-threadsafe-statics -Wno-error=narrowing -flto -w -x c++ -E -CC -mmcu=atmega328p -DF_CPU=16000000L -DARDUINO=10815 -DARDUINO_AVR_DUEMILANOVE -DARDUINO_ARCH_AVR "-IC:\\Program Files (x86)\\Arduino\\hardware\\arduino\\avr\\cores\\arduino" "-IC:\\Program Files (x86)\\Arduino\\hardware\\arduino\\avr\\variants\\standard" "-IC:\\Program Files (x86)\\Arduino\\libraries\\SdFat\\src" "-IC:\\Program Files (x86)\\Arduino\\hardware\\arduino\\avr\\libraries\\SPI\\src" "-IC:\\Program Files (x86)\\Arduino\\libraries\\AccelStepper" "-IC:\\Program Files (x86)\\Arduino\\libraries\\ITEADLIB_Arduino_Nextion-master" "C:\\Program Files (x86)\\Arduino\\libraries\\ITEADLIB_Arduino_Nextion-master\\NexText.cpp" -o nul

"C:\\Program Files (x86)\\Arduino\\hardware\\tools\\avr/bin/avr-g++" -c -g -Os -w -std=gnu++11 -fpermissive -fno-exceptions -ffunction-sections -fdata-sections -fno-threadsafe-statics -Wno-error=narrowing -flto -w -x c++ -E -CC -mmcu=atmega328p -DF_CPU=16000000L -DARDUINO=10815 -DARDUINO_AVR_DUEMILANOVE -DARDUINO_ARCH_AVR "-IC:\\Program Files (x86)\\Arduino\\hardware\\arduino\\avr\\cores\\arduino" "-IC:\\Program Files (x86)\\Arduino\\hardware\\arduino\\avr\\variants\\standard" "-IC:\\Program Files (x86)\\Arduino\\libraries\\SdFat\\src" "-IC:\\Program Files (x86)\\Arduino\\hardware\\arduino\\avr\\libraries\\SPI\\src" "-IC:\\Program Files (x86)\\Arduino\\libraries\\AccelStepper" "-IC:\\Program Files (x86)\\Arduino\\libraries\\ITEADLIB_Arduino_Nextion-master" "C:\\Program Files (x86)\\Arduino\\libraries\\ITEADLIB_Arduino_Nextion-master\\NexTimer.cpp" -o nul

"C:\\Program Files (x86)\\Arduino\\hardware\\tools\\avr/bin/avr-g++" -c -g -Os -w -std=gnu++11 -fpermissive -fno-exceptions -ffunction-sections -fdata-sections -fno-threadsafe-statics -Wno-error=narrowing -flto -w -x c++ -E -CC -mmcu=atmega328p -DF_CPU=16000000L -DARDUINO=10815 -DARDUINO_AVR_DUEMILANOVE -DARDUINO_ARCH_AVR "-IC:\\Program Files (x86)\\Arduino\\hardware\\arduino\\avr\\cores\\arduino" "-IC:\\Program Files (x86)\\Arduino\\hardware\\arduino\\avr\\variants\\standard" "-IC:\\Program Files (x86)\\Arduino\\libraries\\SdFat\\src" "-IC:\\Program Files (x86)\\Arduino\\hardware\\arduino\\avr\\libraries\\SPI\\src" "-IC:\\Program Files (x86)\\Arduino\\libraries\\AccelStepper" "-IC:\\Program Files (x86)\\Arduino\\libraries\\ITEADLIB_Arduino_Nextion-master" "C:\\Program Files (x86)\\Arduino\\libraries\\ITEADLIB_Arduino_Nextion-master\\NexTouch.cpp" -o nul

"C:\\Program Files (x86)\\Arduino\\hardware\\tools\\avr/bin/avr-g++" -c -g -Os -w -std=gnu++11 -fpermissive -fno-exceptions -ffunction-sections -fdata-sections -fno-threadsafe-statics -Wno-error=narrowing -flto -w -x c++ -E -CC -mmcu=atmega328p -DF_CPU=16000000L -DARDUINO=10815 -DARDUINO_AVR_DUEMILANOVE -DARDUINO_ARCH_AVR "-IC:\\Program Files (x86)\\Arduino\\hardware\\arduino\\avr\\cores\\arduino" "-IC:\\Program Files (x86)\\Arduino\\hardware\\arduino\\avr\\variants\\standard" "-IC:\\Program Files (x86)\\Arduino\\libraries\\SdFat\\src" "-IC:\\Program Files (x86)\\Arduino\\hardware\\arduino\\avr\\libraries\\SPI\\src" "-IC:\\Program Files (x86)\\Arduino\\libraries\\AccelStepper" "-IC:\\Program Files (x86)\\Arduino\\libraries\\ITEADLIB_Arduino_Nextion-master" "C:\\Program Files (x86)\\Arduino\\libraries\\ITEADLIB_Arduino_Nextion-master\\NexUpload.cpp" -o nul

Alternatives for SD.h: [SD@1.2.4]

ResolveLibrary(SD.h)

  -> candidates: [SD@1.2.4]

"C:\\Program Files (x86)\\Arduino\\hardware\\tools\\avr/bin/avr-g++" -c -g -Os -w -std=gnu++11 -fpermissive -fno-exceptions -ffunction-sections -fdata-sections -fno-threadsafe-statics -Wno-error=narrowing -flto -w -x c++ -E -CC -mmcu=atmega328p -DF_CPU=16000000L -DARDUINO=10815 -DARDUINO_AVR_DUEMILANOVE -DARDUINO_ARCH_AVR "-IC:\\Program Files (x86)\\Arduino\\hardware\\arduino\\avr\\cores\\arduino" "-IC:\\Program Files (x86)\\Arduino\\hardware\\arduino\\avr\\variants\\standard" "-IC:\\Program Files (x86)\\Arduino\\libraries\\SdFat\\src" "-IC:\\Program Files (x86)\\Arduino\\hardware\\arduino\\avr\\libraries\\SPI\\src" "-IC:\\Program Files (x86)\\Arduino\\libraries\\AccelStepper" "-IC:\\Program Files (x86)\\Arduino\\libraries\\ITEADLIB_Arduino_Nextion-master" "-IC:\\Program Files (x86)\\Arduino\\libraries\\SD\\src" "C:\\Program Files (x86)\\Arduino\\libraries\\ITEADLIB_Arduino_Nextion-master\\NexUpload.cpp" -o nul

Alternatives for SoftwareSerial.h: [SoftwareSerial@1.0]

ResolveLibrary(SoftwareSerial.h)

  -> candidates: [SoftwareSerial@1.0]

"C:\\Program Files (x86)\\Arduino\\hardware\\tools\\avr/bin/avr-g++" -c -g -Os -w -std=gnu++11 -fpermissive -fno-exceptions -ffunction-sections -fdata-sections -fno-threadsafe-statics -Wno-error=narrowing -flto -w -x c++ -E -CC -mmcu=atmega328p -DF_CPU=16000000L -DARDUINO=10815 -DARDUINO_AVR_DUEMILANOVE -DARDUINO_ARCH_AVR "-IC:\\Program Files (x86)\\Arduino\\hardware\\arduino\\avr\\cores\\arduino" "-IC:\\Program Files (x86)\\Arduino\\hardware\\arduino\\avr\\variants\\standard" "-IC:\\Program Files (x86)\\Arduino\\libraries\\SdFat\\src" "-IC:\\Program Files (x86)\\Arduino\\hardware\\arduino\\avr\\libraries\\SPI\\src" "-IC:\\Program Files (x86)\\Arduino\\libraries\\AccelStepper" "-IC:\\Program Files (x86)\\Arduino\\libraries\\ITEADLIB_Arduino_Nextion-master" "-IC:\\Program Files (x86)\\Arduino\\libraries\\SD\\src" "-IC:\\Program Files (x86)\\Arduino\\hardware\\arduino\\avr\\libraries\\SoftwareSerial\\src" "C:\\Program Files (x86)\\Arduino\\libraries\\ITEADLIB_Arduino_Nextion-master\\NexUpload.cpp" -o nul

"C:\\Program Files (x86)\\Arduino\\hardware\\tools\\avr/bin/avr-g++" -c -g -Os -w -std=gnu++11 -fpermissive -fno-exceptions -ffunction-sections -fdata-sections -fno-threadsafe-statics -Wno-error=narrowing -flto -w -x c++ -E -CC -mmcu=atmega328p -DF_CPU=16000000L -DARDUINO=10815 -DARDUINO_AVR_DUEMILANOVE -DARDUINO_ARCH_AVR "-IC:\\Program Files (x86)\\Arduino\\hardware\\arduino\\avr\\cores\\arduino" "-IC:\\Program Files (x86)\\Arduino\\hardware\\arduino\\avr\\variants\\standard" "-IC:\\Program Files (x86)\\Arduino\\libraries\\SdFat\\src" "-IC:\\Program Files (x86)\\Arduino\\hardware\\arduino\\avr\\libraries\\SPI\\src" "-IC:\\Program Files (x86)\\Arduino\\libraries\\AccelStepper" "-IC:\\Program Files (x86)\\Arduino\\libraries\\ITEADLIB_Arduino_Nextion-master" "-IC:\\Program Files (x86)\\Arduino\\libraries\\SD\\src" "-IC:\\Program Files (x86)\\Arduino\\hardware\\arduino\\avr\\libraries\\SoftwareSerial\\src" "C:\\Program Files (x86)\\Arduino\\libraries\\ITEADLIB_Arduino_Nextion-master\\NexVariable.cpp" -o nul

"C:\\Program Files (x86)\\Arduino\\hardware\\tools\\avr/bin/avr-g++" -c -g -Os -w -std=gnu++11 -fpermissive -fno-exceptions -ffunction-sections -fdata-sections -fno-threadsafe-statics -Wno-error=narrowing -flto -w -x c++ -E -CC -mmcu=atmega328p -DF_CPU=16000000L -DARDUINO=10815 -DARDUINO_AVR_DUEMILANOVE -DARDUINO_ARCH_AVR "-IC:\\Program Files (x86)\\Arduino\\hardware\\arduino\\avr\\cores\\arduino" "-IC:\\Program Files (x86)\\Arduino\\hardware\\arduino\\avr\\variants\\standard" "-IC:\\Program Files (x86)\\Arduino\\libraries\\SdFat\\src" "-IC:\\Program Files (x86)\\Arduino\\hardware\\arduino\\avr\\libraries\\SPI\\src" "-IC:\\Program Files (x86)\\Arduino\\libraries\\AccelStepper" "-IC:\\Program Files (x86)\\Arduino\\libraries\\ITEADLIB_Arduino_Nextion-master" "-IC:\\Program Files (x86)\\Arduino\\libraries\\SD\\src" "-IC:\\Program Files (x86)\\Arduino\\hardware\\arduino\\avr\\libraries\\SoftwareSerial\\src" "C:\\Program Files (x86)\\Arduino\\libraries\\ITEADLIB_Arduino_Nextion-master\\NexWaveform.cpp" -o nul

"C:\\Program Files (x86)\\Arduino\\hardware\\tools\\avr/bin/avr-g++" -c -g -Os -w -std=gnu++11 -fpermissive -fno-exceptions -ffunction-sections -fdata-sections -fno-threadsafe-statics -Wno-error=narrowing -flto -w -x c++ -E -CC -mmcu=atmega328p -DF_CPU=16000000L -DARDUINO=10815 -DARDUINO_AVR_DUEMILANOVE -DARDUINO_ARCH_AVR "-IC:\\Program Files (x86)\\Arduino\\hardware\\arduino\\avr\\cores\\arduino" "-IC:\\Program Files (x86)\\Arduino\\hardware\\arduino\\avr\\variants\\standard" "-IC:\\Program Files (x86)\\Arduino\\libraries\\SdFat\\src" "-IC:\\Program Files (x86)\\Arduino\\hardware\\arduino\\avr\\libraries\\SPI\\src" "-IC:\\Program Files (x86)\\Arduino\\libraries\\AccelStepper" "-IC:\\Program Files (x86)\\Arduino\\libraries\\ITEADLIB_Arduino_Nextion-master" "-IC:\\Program Files (x86)\\Arduino\\libraries\\SD\\src" "-IC:\\Program Files (x86)\\Arduino\\hardware\\arduino\\avr\\libraries\\SoftwareSerial\\src" "C:\\Program Files (x86)\\Arduino\\libraries\\SD\\src\\File.cpp" -o nul

"C:\\Program Files (x86)\\Arduino\\hardware\\tools\\avr/bin/avr-g++" -c -g -Os -w -std=gnu++11 -fpermissive -fno-exceptions -ffunction-sections -fdata-sections -fno-threadsafe-statics -Wno-error=narrowing -flto -w -x c++ -E -CC -mmcu=atmega328p -DF_CPU=16000000L -DARDUINO=10815 -DARDUINO_AVR_DUEMILANOVE -DARDUINO_ARCH_AVR "-IC:\\Program Files (x86)\\Arduino\\hardware\\arduino\\avr\\cores\\arduino" "-IC:\\Program Files (x86)\\Arduino\\hardware\\arduino\\avr\\variants\\standard" "-IC:\\Program Files (x86)\\Arduino\\libraries\\SdFat\\src" "-IC:\\Program Files (x86)\\Arduino\\hardware\\arduino\\avr\\libraries\\SPI\\src" "-IC:\\Program Files (x86)\\Arduino\\libraries\\AccelStepper" "-IC:\\Program Files (x86)\\Arduino\\libraries\\ITEADLIB_Arduino_Nextion-master" "-IC:\\Program Files (x86)\\Arduino\\libraries\\SD\\src" "-IC:\\Program Files (x86)\\Arduino\\hardware\\arduino\\avr\\libraries\\SoftwareSerial\\src" "C:\\Program Files (x86)\\Arduino\\libraries\\SD\\src\\SD.cpp" -o nul

"C:\\Program Files (x86)\\Arduino\\hardware\\tools\\avr/bin/avr-g++" -c -g -Os -w -std=gnu++11 -fpermissive -fno-exceptions -ffunction-sections -fdata-sections -fno-threadsafe-statics -Wno-error=narrowing -flto -w -x c++ -E -CC -mmcu=atmega328p -DF_CPU=16000000L -DARDUINO=10815 -DARDUINO_AVR_DUEMILANOVE -DARDUINO_ARCH_AVR "-IC:\\Program Files (x86)\\Arduino\\hardware\\arduino\\avr\\cores\\arduino" "-IC:\\Program Files (x86)\\Arduino\\hardware\\arduino\\avr\\variants\\standard" "-IC:\\Program Files (x86)\\Arduino\\libraries\\SdFat\\src" "-IC:\\Program Files (x86)\\Arduino\\hardware\\arduino\\avr\\libraries\\SPI\\src" "-IC:\\Program Files (x86)\\Arduino\\libraries\\AccelStepper" "-IC:\\Program Files (x86)\\Arduino\\libraries\\ITEADLIB_Arduino_Nextion-master" "-IC:\\Program Files (x86)\\Arduino\\libraries\\SD\\src" "-IC:\\Program Files (x86)\\Arduino\\hardware\\arduino\\avr\\libraries\\SoftwareSerial\\src" "C:\\Program Files (x86)\\Arduino\\libraries\\SD\\src\\utility\\Sd2Card.cpp" -o nul

"C:\\Program Files (x86)\\Arduino\\hardware\\tools\\avr/bin/avr-g++" -c -g -Os -w -std=gnu++11 -fpermissive -fno-exceptions -ffunction-sections -fdata-sections -fno-threadsafe-statics -Wno-error=narrowing -flto -w -x c++ -E -CC -mmcu=atmega328p -DF_CPU=16000000L -DARDUINO=10815 -DARDUINO_AVR_DUEMILANOVE -DARDUINO_ARCH_AVR "-IC:\\Program Files (x86)\\Arduino\\hardware\\arduino\\avr\\cores\\arduino" "-IC:\\Program Files (x86)\\Arduino\\hardware\\arduino\\avr\\variants\\standard" "-IC:\\Program Files (x86)\\Arduino\\libraries\\SdFat\\src" "-IC:\\Program Files (x86)\\Arduino\\hardware\\arduino\\avr\\libraries\\SPI\\src" "-IC:\\Program Files (x86)\\Arduino\\libraries\\AccelStepper" "-IC:\\Program Files (x86)\\Arduino\\libraries\\ITEADLIB_Arduino_Nextion-master" "-IC:\\Program Files (x86)\\Arduino\\libraries\\SD\\src" "-IC:\\Program Files (x86)\\Arduino\\hardware\\arduino\\avr\\libraries\\SoftwareSerial\\src" "C:\\Program Files (x86)\\Arduino\\libraries\\SD\\src\\utility\\SdFile.cpp" -o nul

"C:\\Program Files (x86)\\Arduino\\hardware\\tools\\avr/bin/avr-g++" -c -g -Os -w -std=gnu++11 -fpermissive -fno-exceptions -ffunction-sections -fdata-sections -fno-threadsafe-statics -Wno-error=narrowing -flto -w -x c++ -E -CC -mmcu=atmega328p -DF_CPU=16000000L -DARDUINO=10815 -DARDUINO_AVR_DUEMILANOVE -DARDUINO_ARCH_AVR "-IC:\\Program Files (x86)\\Arduino\\hardware\\arduino\\avr\\cores\\arduino" "-IC:\\Program Files (x86)\\Arduino\\hardware\\arduino\\avr\\variants\\standard" "-IC:\\Program Files (x86)\\Arduino\\libraries\\SdFat\\src" "-IC:\\Program Files (x86)\\Arduino\\hardware\\arduino\\avr\\libraries\\SPI\\src" "-IC:\\Program Files (x86)\\Arduino\\libraries\\AccelStepper" "-IC:\\Program Files (x86)\\Arduino\\libraries\\ITEADLIB_Arduino_Nextion-master" "-IC:\\Program Files (x86)\\Arduino\\libraries\\SD\\src" "-IC:\\Program Files (x86)\\Arduino\\hardware\\arduino\\avr\\libraries\\SoftwareSerial\\src" "C:\\Program Files (x86)\\Arduino\\libraries\\SD\\src\\utility\\SdVolume.cpp" -o nul

"C:\\Program Files (x86)\\Arduino\\hardware\\tools\\avr/bin/avr-g++" -c -g -Os -w -std=gnu++11 -fpermissive -fno-exceptions -ffunction-sections -fdata-sections -fno-threadsafe-statics -Wno-error=narrowing -flto -w -x c++ -E -CC -mmcu=atmega328p -DF_CPU=16000000L -DARDUINO=10815 -DARDUINO_AVR_DUEMILANOVE -DARDUINO_ARCH_AVR "-IC:\\Program Files (x86)\\Arduino\\hardware\\arduino\\avr\\cores\\arduino" "-IC:\\Program Files (x86)\\Arduino\\hardware\\arduino\\avr\\variants\\standard" "-IC:\\Program Files (x86)\\Arduino\\libraries\\SdFat\\src" "-IC:\\Program Files (x86)\\Arduino\\hardware\\arduino\\avr\\libraries\\SPI\\src" "-IC:\\Program Files (x86)\\Arduino\\libraries\\AccelStepper" "-IC:\\Program Files (x86)\\Arduino\\libraries\\ITEADLIB_Arduino_Nextion-master" "-IC:\\Program Files (x86)\\Arduino\\libraries\\SD\\src" "-IC:\\Program Files (x86)\\Arduino\\hardware\\arduino\\avr\\libraries\\SoftwareSerial\\src" "C:\\Program Files (x86)\\Arduino\\hardware\\arduino\\avr\\libraries\\SoftwareSerial\\src\\SoftwareSerial.cpp" -o nul

Generating function prototypes...

"C:\\Program Files (x86)\\Arduino\\hardware\\tools\\avr/bin/avr-g++" -c -g -Os -w -std=gnu++11 -fpermissive -fno-exceptions -ffunction-sections -fdata-sections -fno-threadsafe-statics -Wno-error=narrowing -flto -w -x c++ -E -CC -mmcu=atmega328p -DF_CPU=16000000L -DARDUINO=10815 -DARDUINO_AVR_DUEMILANOVE -DARDUINO_ARCH_AVR "-IC:\\Program Files (x86)\\Arduino\\hardware\\arduino\\avr\\cores\\arduino" "-IC:\\Program Files (x86)\\Arduino\\hardware\\arduino\\avr\\variants\\standard" "-IC:\\Program Files (x86)\\Arduino\\libraries\\SdFat\\src" "-IC:\\Program Files (x86)\\Arduino\\hardware\\arduino\\avr\\libraries\\SPI\\src" "-IC:\\Program Files (x86)\\Arduino\\libraries\\AccelStepper" "-IC:\\Program Files (x86)\\Arduino\\libraries\\ITEADLIB_Arduino_Nextion-master" "-IC:\\Program Files (x86)\\Arduino\\libraries\\SD\\src" "-IC:\\Program Files (x86)\\Arduino\\hardware\\arduino\\avr\\libraries\\SoftwareSerial\\src" "C:\\Users\\STPHAN~1\\AppData\\Local\\Temp\\arduino_build_495330\\sketch\\Annealer-Master.ino.cpp" -o "C:\\Users\\STPHAN~1\\AppData\\Local\\Temp\\arduino_build_495330\\preproc\\ctags_target_for_gcc_minus_e.cpp"

"C:\\Program Files (x86)\\Arduino\\tools-builder\\ctags\\5.8-arduino11/ctags" -u --language-force=c++ -f - --c++-kinds=svpf --fields=KSTtzns --line-directives "C:\\Users\\STPHAN~1\\AppData\\Local\\Temp\\arduino_build_495330\\preproc\\ctags_target_for_gcc_minus_e.cpp"

Compilation du croquis...

"C:\\Program Files (x86)\\Arduino\\hardware\\tools\\avr/bin/avr-g++" -c -g -Os -w -std=gnu++11 -fpermissive -fno-exceptions -ffunction-sections -fdata-sections -fno-threadsafe-statics -Wno-error=narrowing -MMD -flto -mmcu=atmega328p -DF_CPU=16000000L -DARDUINO=10815 -DARDUINO_AVR_DUEMILANOVE -DARDUINO_ARCH_AVR "-IC:\\Program Files (x86)\\Arduino\\hardware\\arduino\\avr\\cores\\arduino" "-IC:\\Program Files (x86)\\Arduino\\hardware\\arduino\\avr\\variants\\standard" "-IC:\\Program Files (x86)\\Arduino\\libraries\\SdFat\\src" "-IC:\\Program Files (x86)\\Arduino\\hardware\\arduino\\avr\\libraries\\SPI\\src" "-IC:\\Program Files (x86)\\Arduino\\libraries\\AccelStepper" "-IC:\\Program Files (x86)\\Arduino\\libraries\\ITEADLIB_Arduino_Nextion-master" "-IC:\\Program Files (x86)\\Arduino\\libraries\\SD\\src" "-IC:\\Program Files (x86)\\Arduino\\hardware\\arduino\\avr\\libraries\\SoftwareSerial\\src" "C:\\Users\\STPHAN~1\\AppData\\Local\\Temp\\arduino_build_495330\\sketch\\Annealer-Master.ino.cpp" -o "C:\\Users\\STPHAN~1\\AppData\\Local\\Temp\\arduino_build_495330\\sketch\\Annealer-Master.ino.cpp.o"

D:\Téléchargements\Annealer-Master\Annealer-Master.ino: In function 'void Read_SDcard()':

Annealer-Master:1448:16: error: 'FatFile* FatVolume::vwd()' is private within this context

In file included from C:\Program Files (x86)\Arduino\libraries\SdFat\src/FatLib/FatLib.h:27:0,

                 from C:\Program Files (x86)\Arduino\libraries\SdFat\src/SdFat.h:34,

                 from D:\Téléchargements\Annealer-Master\Annealer-Master.ino:1:

C:\Program Files (x86)\Arduino\libraries\SdFat\src/FatLib/FatVolume.h:336:12: note: declared private here

   FatFile* vwd() {return &m_vwd;}

            ^~~

Annealer-Master:1451:37: error: 'FatFile* FatVolume::vwd()' is private within this context

In file included from C:\Program Files (x86)\Arduino\libraries\SdFat\src/FatLib/FatLib.h:27:0,

                 from C:\Program Files (x86)\Arduino\libraries\SdFat\src/SdFat.h:34,

                 from D:\Téléchargements\Annealer-Master\Annealer-Master.ino:1:

C:\Program Files (x86)\Arduino\libraries\SdFat\src/FatLib/FatVolume.h:336:12: note: declared private here

   FatFile* vwd() {return &m_vwd;}

            ^~~

D:\Téléchargements\Annealer-Master\Annealer-Master.ino: In function 'void SettingsReset(void*)':

Annealer-Master:1766:29: error: 'RSTC' was not declared in this scope

D:\Téléchargements\Annealer-Master\Annealer-Master.ino:1766:29: note: suggested alternative: 'MSTR'

Annealer-Master:1766:3: error: 'rstc_start_software_reset' was not declared in this scope

Utilisation de la bibliothèque SdFat version 2.0.7 dans le dossier: C:\Program Files (x86)\Arduino\libraries\SdFat 

Utilisation de la bibliothèque SPI version 1.0 dans le dossier: C:\Program Files (x86)\Arduino\hardware\arduino\avr\libraries\SPI 

Utilisation de la bibliothèque AccelStepper prise dans le dossier : C:\Program Files (x86)\Arduino\libraries\AccelStepper (legacy)

Utilisation de la bibliothèque ITEADLIB_Arduino_Nextion-master prise dans le dossier : C:\Program Files (x86)\Arduino\libraries\ITEADLIB_Arduino_Nextion-master (legacy)

Utilisation de la bibliothèque SD version 1.2.4 dans le dossier: C:\Program Files (x86)\Arduino\libraries\SD 

Utilisation de la bibliothèque SoftwareSerial version 1.0 dans le dossier: C:\Program Files (x86)\Arduino\hardware\arduino\avr\libraries\SoftwareSerial 

exit status 1

'FatFile* FatVolume::vwd()' is private within this context


J'ai bien conscience que l'on ne peut pas débuter en programmation par un projet aussi complexe, mais j'aimerai le faire fonctionner quand même, et par la suite en le prenant en main apporter les modifications que j'aimerai.

Si vous pouviez m'aider à passer l'étape du débeuggage ce serai sympa.
Merci.

Stéphane

Topic déplacé dans la section principale

:warning:
et merci de lire et d'appliquer les bonnes pratiques du forum francophone

Bonjour,

J'ai continué à déboguer, j'en suis arrivé avec ce message d'erreur :

)C:\Users\St�phane\OneDrive\Documents\Arduino\libraries\ITEADLIB_Arduino_Nextion-master\NexUpload.cpp:17:28: fatal error: SoftwareSerial.h: No such file or directory

  -> candidates: [] #include <SoftwareSerial.h>

Tu n'as pas besoin de SoftwareSerial avec une DUE puisqu'elle possède 4 ports série.
Si c'est pour le Nextion, il est raccordé sur Serial2 d'ailleurs.

Merci beaucoup pour cette réponse. Mais je ne sais comment faire pour modifier ça dans mon code.

Ces deux messages (#1 et #3) sont contradictoires.

Où est passé C:\Program Files (x86)\Arduino\hardware\arduino\avr\libraries\SoftwareSerial ?

Oui j'en perd mon latin. Je vais repartir de zéro, désinstaller Arduino, nettoyer mes dossiers et repartir sur une installation propre avec le projet d'origine et les librairies nécessaires.

Edit : j'ai ce message quand je met les librairies :

Bibliothèque non valide trouvée dans C:\Program Files (x86)\Arduino\libraries\Adafruit_WICED_Arduino-master : aucun fichier d'en-tête (.h) trouvé dans C:\Program Files (x86)\Arduino\libraries\Adafruit_WICED_Arduino-master

Probablement un répertoire vide dans le dossier libraries, pas grave.

Je viens de tout remettre en ordre, mais encore un message de défaut en fin de compilation :

C:\Program Files (x86)\Arduino\libraries\ITEADLIB_Arduino_Nextion-master\NexUpload.cpp:17:28: fatal error: SoftwareSerial.h: No such file or directory

Bonjour,

Ta bibliothèque a été mal installée.
Supprimes le répertoire et installes la bibliothèque avec le gestionnaire de bibliothèques.

C'est bien ce que je pense mais quand je pointe vers le fichier zip en installant la librairie via gestion "gérer les bibliothèques j'ai ça :

Le dossier spécifié ne contiens pas de bibliothèque valide

Tu fais "Outils/Gérer les bibliothèques"
Tu recheches «wiced» (en haut à droite) et tu cliques sur installer

Pourquoi utiliser Adafruit_WICED_Arduino, un package pour la Adafruit Feather ?

Ca ne fonctionne toujours pas, j'ai toujours ce message :

Alternatives for SoftwareSerial.h: []C:\Program Files (x86)\Arduino\libraries\ITEADLIB_Arduino_Nextion-master\NexUpload.cpp:17:28: fatal error: SoftwareSerial.h: No such file or directory

ResolveLibrary(SoftwareSerial.h) #include <SoftwareSerial.h>

  -> candidates: []                            ^

compilation terminated.
Utilisation de la bibliothèque SdFat version 2.0.7 dans le dossier: C:\Program Files (x86)\Arduino\libraries\SdFat 
Utilisation de la bibliothèque SPI version 1.0 dans le dossier: C:\Users\Stéphane\AppData\Local\Arduino15\packages\arduino\hardware\sam\1.6.12\libraries\SPI 
Utilisation de la bibliothèque AccelStepper prise dans le dossier : C:\Program Files (x86)\Arduino\libraries\AccelStepper (legacy)
Utilisation de la bibliothèque ITEADLIB_Arduino_Nextion-master prise dans le dossier : C:\Program Files (x86)\Arduino\libraries\ITEADLIB_Arduino_Nextion-master (legacy)
Utilisation de la bibliothèque SD version 1.2.4 dans le dossier: C:\Program Files (x86)\Arduino\libraries\SD 
exit status 1
Erreur de compilation pour la carte Arduino Due (Native USB Port)

Le fichier que je voudrais compiler :

Annealer-Master.ino (66,9 Ko)

Dans ton premier post :

Une Duemilanove n'est pas une DUE.

Oui au début je n'avais pas déclaré la bonne carte.

Quand on aura toutes les infos : quel projet ?

Le schéma du projet est dans le premier post, il manque des infos ?

L'URL où tu es allé pêcher le code, et les explications.

Le projet en vidéo c'est celui là :

Et le post ou l'auteur nous as donné son code :
https://forum.accurateshooter.com/threads/induction-brass-annealer-redux.3908353/page-89#post-37571030