avr-g++: error:

Hello,

This error message appears when i either upload or verify a sketch, i have followed all trouble shooting options proposed on other threads which explains why i have created a new post as i have ran out of options.

The options i have tried are: Check whether Cygwin is installed. Check for the GCC system variables under system properties (I'm running windows) check for the path of the GCC variable through an echo command in CMD. Reinstall Arduino Software Reinstall Windows

:( unfortunaltly no luck in all of them.

Would someone propose new options, i don't seem to face this issue on my other PC

Many Thanks

what is the error message exactly? what is the code you use? what version of windows do you use? which version of the IDE do you use?

The error message is as follows:

avr-g++: error: C:\Users\Aboudis\AppData\Local\Temp\build8728547173789246869.tmp\sketch_dec30a.cpp -o C:\Users\Aboudis\AppData\Local\Temp\build8728547173789246869.tmp\sketch_dec30a.cpp.o: No such file or directory avr-g++: fatal error: no input files compilation terminated. Error compiling.

The IDE is Arduino 1.5.8

The error appears with any sketch for example ReadAnalougeVoltage

My OS is windows 7

Many thanks

hello my friend pleas help me.

I new have been install Arduino 1.6.1 in my laptop (windows 7). when I upload (verify) a program such as

Blink example this get me a error. this cant compile a program. error is following:

Arduino: 1.6.0 (Windows 7), Board: “Arduino Uno”

C:\Program Files (x86)\Arduino/hardware/tools/avr/bin/avr-g++ -c -g -Os -w -fno-exceptions -ffunction-sections -fdata-sections -fno-threadsafe-statics -MMD -mmcu=atmega328p -DF_CPU=16000000L -DARDUINO=10600 -DARDUINO_AVR_UNO -DARDUINO_ARCH_AVR -IC:\Program Files (x86)\Arduino\hardware\arduino\avr\cores\arduino -IC:\Program Files (x86)\Arduino\hardware\arduino\avr\variants\standard C:\Users\Arsenal\AppData\Local\Temp\build7178445014070418565.tmp\Blink.cpp -o C:\Users\Arsenal\AppData\Local\Temp\build7178445014070418565.tmp\Blink.cpp.o

avr-g++: error: spawn: No such file or directory
Error compiling.